program: Gaussian 09
title: 000094568
version: EM64L-G09RevD.01
frameworkgroup: C1[X(C11H20O2)]
method: RPBEPBE
basis: SDD
operation: Freq
keyword: #pfreq=noraman
keyword: PBEPBE/SDD
title: #p freq=noraman PBEPBE/SDD
converged: NO YES NO NO
title: Mulliken charges:
elementType: O O C C C C C C C C C C C H H H H H H H H H H H H H H H H H H H H
charge: -0.270803 -0.222494 0.329311 -0.403980 -0.395855 -0.732475 -0.723345 -0.732119 -0.370661 -0.527635 0.235573 0.049955 -0.573994 0.193718 0.193633 0.202744 0.202538 0.209496 0.214207 0.208763 0.209907 0.209986 0.209447 0.213659 0.208852 0.209549 0.216017 0.215310 0.251471 0.251601 0.256778 0.225886 0.234959
chargesum: 0.00000
title: Mulliken charges with hydrogens summed into heavy atoms:
elementType: O O C C C C C C C C C C C
charge: -0.270803 -0.222494 0.329311 -0.016629 0.009427 -0.100009 -0.094004 -0.100059 0.060665 -0.024562 0.235573 0.306732 -0.113149
polarizability: 1.77940998e+02 1.31014151e+01 1.17259548e+02 2.58520462e-01 2.65516533e-02 9.30709439e+01
1716.lowfreq: -6.8930 -5.0959 -0.0008 -0.0007 -0.0002 6.3131 16.2770 33.4535 48.8716
frequency: 10.2026 33.0501 48.8496 66.1820 94.5354 108.5301 131.4667 135.9014 154.8674 178.9926 204.9855 240.2888 247.9647 250.7637 303.9120 315.8813 359.4272 382.7653 397.3490 420.2151 468.8249 491.3105 532.0907 687.0074 695.6680 725.8162 736.3632 771.2950 819.9603 886.1390 900.3379 905.5684 923.0273 923.8968 933.5466 945.4851 970.5594 993.1305 1004.8005 1044.8491 1056.1517 1074.5693 1084.4919 1097.1877 1113.3596 1123.7928 1201.8943 1222.8037 1244.7278 1262.0251 1266.4069 1280.2032 1290.3369 1308.8323 1313.8717 1352.2689 1362.4158 1368.6888 1369.1730 1393.8772 1394.1828 1436.6764 1451.5970 1458.0501 1465.4138 1466.8983 1467.0493 1482.1203 1482.5479 1483.1944 1494.1668 1655.2014 1665.9722 2946.8896 2961.6266 2964.3101 2967.7933 2971.4529 2985.3446 2994.7691 2994.9792 3020.4895 3032.7044 3056.6470 3058.4564 3059.0336 3063.2648 3065.1045 3066.4609 3069.3480 3121.3112 3158.5829 3238.9413
redmass: 4.3726 3.5102 3.9651 1.9126 2.6853 2.2406 1.8763 3.7514 2.6601 4.7397 1.1013 2.6830 1.1364 1.0626 3.3212 2.0659 2.6174 3.3911 2.0363 2.7917 3.0374 2.7703 2.6390 4.9082 1.5139 1.1080 3.5293 1.3136 3.4587 1.4965 2.3107 1.3918 1.6841 1.6265 1.2129 3.8183 1.1056 1.3348 1.7092 3.4010 2.4808 1.5303 2.4615 3.4898 2.6720 1.2791 1.9385 1.7351 1.8697 2.3077 1.4472 1.1697 1.0811 1.5058 1.2949 1.5333 1.5852 1.2317 1.2485 1.1909 1.1912 1.0838 1.0740 1.0518 1.0592 1.0686 1.0466 1.0606 1.0610 1.0963 1.0625 4.7788 10.2081 1.0584 1.0349 1.0349 1.0549 1.0397 1.0612 1.0962 1.0623 1.1004 1.1009 1.1003 1.0999 1.1009 1.1021 1.0988 1.0985 1.0981 1.0584 1.0999 1.1157
irintensity: 0.5171 0.1921 0.2907 0.1564 0.0944 1.1762 0.2889 0.5066 8.6028 3.7003 0.0006 5.3560 0.0903 0.0113 6.4010 0.0383 2.1239 1.1374 0.0207 0.4819 1.2928 5.5993 1.5525 2.7000 4.9148 11.2015 1.5213 0.6324 13.3661 2.1771 6.4692 85.1695 0.8688 0.7888 0.0022 34.0765 44.6192 0.4409 2.6114 112.3776 2.0887 1.0857 2.2785 410.2340 201.4591 0.2300 8.5286 2.8050 76.8973 10.8608 0.5645 7.6934 0.1388 16.9353 4.3150 19.0511 16.3141 24.9445 24.4877 7.5452 5.4272 26.0251 0.6727 0.0119 0.2060 1.3376 0.7792 10.3243 14.4156 5.8965 30.6800 69.8170 198.6762 26.7935 36.0536 43.0472 23.6949 18.9636 6.7605 6.8316 36.5798 17.9138 7.6616 0.6049 1.4899 0.0528 123.5440 22.6729 96.6794 107.0969 0.8159 14.7976 9.4667
temp: 298.150 k
press: 1.00000 atm
elementType: 8 8 6 6 6 6 6 6 6 6 6 6 6 1 1 1 1 1 1 1 1 1 1 1 1 1 1 1 1 1 1 1 1
symmnumber: 1
zpe: 750258.7 jmol-1
zpe.correction: 0.285758 hartree
zpe.thermalcorrener: 0.302342 hartree
zpe.thermalcorrenthalpy: 0.303286 hartree
zpe.thermalcorrgfe: 0.239494 hartree
zpe.sumelectzpe: -580.544406 hartree
zpe.sumelectthermal: -580.527823 hartree
zpe.sumelectthermalent: -580.526879 hartree
zpe.sumelectthermalfe: -580.590670 hartree
dipole: 0.6791 -1.4651 0.0129
dipole: 1.6149
quadrupole: -76.3215 -85.7816 -82.3001
quadrupole: 3.1802 0.0135 0.0247
quadrupole: 5.1462 -4.3138 -0.8324 3.1802 0.0135 0.0247
hfenergy: -580.8301648 hartree
pointgroup: C01 [X(C11H20O2)]
dipole: 0.2637111 -0.5766559 -0.039905 debye
polarizability: 178.0870078|12.7692047|117.0041307|-0.0649236|1.5475341|93.1803509 unknown
InChI: InChI=1S/C11H20O2/c1-5-13-10(12)8-6-7-9-11(2,3)4/h5H,1,6-9H2,2-4H3
charge 0 multiplicity 1
33 atoms
O  -3.654059 -0.483909 0.066373
O  -2.699007 1.654633 0.203784
C  3.941568 -0.084978 -0.021021
C  2.553767 0.62872 0.04846
C  1.303008 -0.279084 0.017216
C  4.130171 -1.044951 1.183813
C  5.044088 1.007731 0.031127
C  4.087501 -0.879398 -1.346783
C  -0.005567 0.540477 0.081131
C  -1.255923 -0.359286 0.055453
C  -2.553672 0.41965 0.118764
C  -4.967304 0.057868 0.117079
C  -6.035261 -0.765491 0.064965
H  2.523595 1.238796 0.976331
H  2.490588 1.347049 -0.796444
H  1.303407 -0.892215 -0.906414
H  1.330425 -0.988269 0.868968
H  4.004464 -0.507326 2.143158
H  3.404392 -1.878372 1.161438
H  5.144808 -1.486168 1.173213
H  4.977109 1.595843 0.966357
H  4.949398 1.710386 -0.818751
H  6.052542 0.554664 -0.013652
H  3.365667 -1.714435 -1.408223
H  5.103003 -1.310828 -1.430622
H  3.925566 -0.222149 -2.222612
H  -0.016749 1.160333 0.998287
H  -0.045684 1.250641 -0.767213
H  -1.24786 -1.074841 0.901523
H  -1.277996 -0.985161 -0.858479
H  -5.008573 1.149825 0.19787
H  -7.043676 -0.346111 0.105335
H  -5.923737 -1.850541 -0.017034
