program: Gaussian 09
title: 000094549
version: EM64L-G09RevD.01
frameworkgroup: C1[X(C10H16N2O)]
method: RPBEPBE
basis: SDD
operation: Freq
keyword: #p
keyword: freq=noraman
keyword: PBEPBE/SDD
title: #p freq=noraman PBEPBE/SDD
converged: YES YES NO NO
title: Mulliken charges:
elementType: O N N C C C C C C C C C C H H H H H H H H H H H H H H H H
charge: -0.266680 -0.080909 -0.062649 -0.176716 -0.401300 -0.430791 0.154481 -0.367181 -0.396406 -0.525418 -0.453853 -0.479741 -0.072427 0.229570 0.232506 0.203396 0.232281 0.214999 0.208898 0.205306 0.260779 0.210215 0.240532 0.242688 0.231210 0.228003 0.234173 0.226303 0.158731
chargesum: 0.00000
title: Mulliken charges with hydrogens summed into heavy atoms:
elementType: O N N C C C C C C C C C C
charge: -0.266680 -0.080909 -0.062649 0.052854 0.034602 0.016489 0.154481 0.047024 0.074588 -0.042198 0.005360 -0.019265 0.086304
polarizability: 1.34400675e+02 1.25458548e+01 1.23743892e+02 -6.61820338e-01 -1.63198662e+00 9.69556663e+01
1716.lowfreq: -21.7682 -8.1446 -0.0006 -0.0005 -0.0004 15.5584 31.2083 51.7164 79.7157
frequency: 28.2011 51.6975 79.5681 110.3282 134.2234 193.4001 232.8369 258.5065 286.7938 304.0082 357.0076 365.4696 427.3979 451.5546 497.4779 573.8365 642.8332 683.2145 736.8573 777.4054 797.0005 822.1716 848.7554 855.0117 879.4057 903.9484 917.8561 920.6070 956.9776 960.0678 983.1214 1016.1263 1033.2257 1047.9859 1086.2591 1095.9749 1119.8219 1142.9247 1158.7544 1163.4306 1194.4028 1203.9773 1221.5653 1243.6619 1263.2703 1271.3978 1288.7842 1292.2290 1298.4763 1320.4960 1334.4402 1341.2656 1350.5935 1352.4343 1382.0020 1400.7555 1445.0381 1449.7346 1460.2591 1463.9343 1468.4593 1477.2661 1482.1071 1612.9435 1623.3590 2905.9506 2951.9499 2966.3344 2986.3830 2988.2647 2993.9889 2994.3939 2996.3583 3018.1510 3044.7767 3045.9214 3057.8311 3058.4599 3074.9895 3075.9862 3090.9927
redmass: 3.2793 5.9741 2.6696 1.9869 2.9641 2.9227 3.0367 3.5314 2.9511 2.3650 2.4202 3.6008 2.7952 2.8492 3.3740 2.3598 2.2633 2.8327 2.7017 3.8393 2.5023 1.6882 2.7563 2.2901 1.6810 2.0409 2.4900 2.0730 2.3467 2.0567 2.3692 2.8589 1.6426 2.0662 1.6501 1.9586 1.7643 1.4105 1.5247 1.4712 1.1808 1.4870 1.7065 1.9756 1.3307 1.2866 1.2800 1.4653 1.3407 1.9732 1.3610 1.4336 1.4212 1.4442 1.3944 1.9567 1.0894 1.0927 1.0872 1.0897 1.0823 1.0993 1.0855 7.7007 6.8715 1.0848 1.0811 1.0678 1.0600 1.0621 1.0640 1.0628 1.0654 1.0673 1.1005 1.0971 1.1005 1.0978 1.0970 1.0986 1.1046
irintensity: 2.7695 3.5908 0.2262 1.1364 2.1348 0.4750 8.5004 12.3940 1.1012 13.4685 0.7182 0.7857 12.3182 1.2086 1.2854 4.2154 8.1141 4.1959 2.6885 6.1908 3.3161 6.7363 8.4085 3.4431 2.2800 0.9039 4.7736 14.0265 12.5705 3.8290 40.7481 9.4095 2.0692 1.4375 7.7867 7.5128 2.1062 1.7017 24.0855 7.6255 1.9544 5.3493 27.5284 26.2643 8.4459 13.2490 5.7927 9.5821 9.3707 6.4712 0.2645 2.5108 3.1359 0.4165 7.8684 84.2953 16.5145 5.5008 4.9370 12.6542 24.0405 12.6738 10.2082 4.6380 444.1878 84.5821 23.7700 31.5444 32.6905 23.2195 46.6638 31.7376 35.6509 27.0184 38.4239 10.1578 55.1833 24.6901 3.5358 31.0581 39.4932
temp: 298.150 k
press: 1.00000 atm
elementType: 8 7 7 6 6 6 6 6 6 6 6 6 6 1 1 1 1 1 1 1 1 1 1 1 1 1 1 1 1
symmnumber: 1
zpe: 654331.2 jmol-1
zpe.correction: 0.249222 hartree
zpe.thermalcorrener: 0.261506 hartree
zpe.thermalcorrenthalpy: 0.262451 hartree
zpe.thermalcorrgfe: 0.209654 hartree
zpe.sumelectzpe: -574.373936 hartree
zpe.sumelectthermal: -574.361651 hartree
zpe.sumelectthermalent: -574.360707 hartree
zpe.sumelectthermalfe: -574.413503 hartree
dipole: 3.2481 1.5079 0.2298
dipole: 3.5884
quadrupole: -84.7753 -87.8654 -73.6451
quadrupole: -15.3499 -2.8163 -3.3709
quadrupole: -2.6800 -5.7701 8.4502 -15.3499 -2.8163 -3.3709
hfenergy: -574.6231572 hartree
pointgroup: C01 [X(C10H16N2O1)]
dipole: -1.2650669 -0.6264864 0.0152315 debye
polarizability: 133.6775134|12.6214927|124.1076154|2.5368197|3.421318|97.3151054 unknown
InChI: InChI=1S/C10H16N2O/c13-8-12-7-2-1-5-10(12)9-4-3-6-11-9/h8,10H,1-7H2
charge 0 multiplicity 1
29 atoms
O  2.715664 2.38578 0.151046
N  1.231311 0.560488 0.222127
N  -1.989077 -1.032235 0.149643
C  0.207153 -0.194678 0.988095
C  0.645486 -1.670493 1.169654
C  1.072175 -2.317482 -0.170377
C  -1.168262 -0.031397 0.339371
C  2.150787 -1.467548 -0.883005
C  1.664275 -0.013279 -1.072315
C  -1.677221 1.33914 -0.122733
C  -3.180462 1.050176 -0.40712
C  -3.24409 -0.51184 -0.485553
C  1.820138 1.70563 0.727416
H  0.144359 0.288012 1.987809
H  -0.193369 -2.236288 1.610309
H  1.495817 -1.693357 1.879473
H  0.181412 -2.419229 -0.818903
H  1.453129 -3.33881 0.017228
H  3.084103 -1.459283 -0.286674
H  2.394874 -1.899046 -1.872401
H  2.459289 0.643182 -1.464616
H  0.812521 0.007257 -1.78382
H  -1.514602 2.127523 0.634725
H  -1.126333 1.657067 -1.030158
H  -3.802071 1.413435 0.43036
H  -3.54147 1.534608 -1.329403
H  -4.11879 -0.939253 0.034886
H  -3.273789 -0.881034 -1.529531
H  1.41284 1.975653 1.731068
