program: Gaussian 09
title: 000094586
version: EM64L-G09RevD.01
frameworkgroup: C1[X(C17H15F3O4)]
method: RPBEPBE
basis: SDD
operation: Freq
keyword: #p
keyword: freq=noraman
keyword: PBEPBE/SDD
title: #p freq=noraman PBEPBE/SDD
converged: YES YES NO NO
title: Mulliken charges:
elementType: F F F O O O O C C C C C C C C C C C C C C C C C H H H H H H H H H H H H H H H
charge: -0.167335 -0.170835 -0.171962 -0.266804 -0.298256 -0.279022 -0.201557 -0.094598 0.373916 0.314586 0.339689 -0.331901 -0.362635 0.296081 -0.372807 -0.349148 -0.715720 -0.361037 -0.331870 -0.346057 -0.306706 0.240809 0.255880 -0.505222 0.242304 0.272006 0.259212 0.263041 0.261598 0.219934 0.242949 0.253727 0.265382 0.273064 0.266793 0.257967 0.250009 0.246859 0.237667
chargesum: 0.00000
title: Mulliken charges with hydrogens summed into heavy atoms:
elementType: F F F O O O O C C C C C C C C C C C C C C C C C
charge: -0.167335 -0.170835 -0.171962 -0.266804 -0.298256 -0.279022 -0.201557 0.147706 0.373916 0.314586 0.339689 -0.059895 -0.103423 0.296081 -0.109765 -0.087550 0.000890 -0.095655 -0.058807 -0.079264 -0.048739 0.240809 0.255880 0.229312
polarizability: 2.93047823e+02 -1.14148446e+01 1.70377266e+02 2.18166420e+01 5.79268851e+00 1.56418040e+02
1716.lowfreq: -8.9084 -4.9209 -2.7679 -0.0007 0.0004 0.0006 6.4217 8.2191 21.0786
frequency: -7.4183 7.3175 20.9671 29.5652 34.1399 46.0487 65.1070 79.7761 84.8918 114.2977 140.8971 151.4097 175.2389 200.1922 207.6096 213.3932 232.3203 262.5333 270.4925 305.1886 322.5288 347.0275 357.1969 368.7201 382.7840 410.7617 418.9978 425.6734 466.9443 490.5854 504.0181 516.9903 556.1054 571.2402 593.2351 627.4190 628.1999 652.9799 669.4109 709.3753 714.8251 723.5394 737.0356 783.9474 800.3571 813.9055 827.9127 836.6356 842.6953 853.7034 900.0098 937.0135 941.3910 953.5805 958.6593 967.9885 980.4783 984.0593 999.5843 1012.9489 1027.4289 1029.2099 1079.1931 1101.8246 1110.3546 1113.8860 1126.5841 1143.1285 1149.2851 1152.1176 1175.6830 1182.9351 1210.3990 1237.4482 1285.8271 1294.7596 1302.8566 1316.2417 1326.5385 1369.0116 1383.6723 1390.3302 1418.8434 1422.5156 1424.7455 1453.3719 1461.2834 1462.8980 1473.9578 1484.0172 1498.7054 1584.7275 1593.9079 1612.1121 1623.2782 1662.6854 3003.2922 3008.6823 3017.8263 3104.9089 3112.6955 3118.2354 3148.2047 3151.9496 3155.7193 3160.9084 3163.4693 3168.7493 3174.9328 3180.7931 3182.8812
redmass: 12.6216 6.5518 6.1524 5.4785 4.9760 4.8194 3.8595 7.4638 1.0919 5.6157 4.7049 5.3911 5.9984 2.6061 6.7075 4.5555 1.3971 4.4309 5.0246 5.3032 7.3850 7.3040 7.4198 7.9346 6.9468 3.0900 3.1398 4.8912 5.7074 4.0604 4.6140 6.6720 3.6635 7.3621 5.0460 7.1125 7.2493 3.8745 7.7959 6.6718 4.8339 4.4969 4.6553 4.7341 3.6206 1.3145 1.2954 1.5547 1.6588 6.1050 5.2216 2.1660 1.8606 1.4405 1.3677 1.8008 2.9891 7.0061 2.7973 3.6651 2.2385 4.2254 1.9899 3.1469 1.3799 1.2817 1.3409 2.3333 1.4373 2.0642 1.2434 1.6722 2.6785 4.6051 4.5856 1.3029 1.2724 1.3380 1.3959 6.1850 6.1510 1.2324 3.4241 1.2050 4.1010 1.0494 1.0441 1.0522 1.0540 2.4216 2.7088 7.5756 7.7443 6.4444 6.4091 9.2632 1.0351 1.0296 1.0850 1.0997 1.1049 1.1015 1.0888 1.0892 1.1052 1.0885 1.0886 1.0961 1.0960 1.0977 1.0975
irintensity: 0.2315 0.5407 1.4310 0.8858 0.2011 0.1566 0.2743 1.1421 0.3036 0.6417 0.3297 4.3324 2.0927 1.9880 1.1520 1.1235 2.9171 9.9007 2.4826 7.5174 1.1538 9.9170 4.5932 1.0966 4.9902 1.3866 0.3986 7.3662 3.3029 5.5733 27.0282 3.9348 17.0390 8.3320 7.7704 7.0511 2.4710 9.8719 1.3148 9.8298 1.6131 13.1898 14.5326 3.9267 8.6927 10.9936 9.8719 98.5327 63.0838 42.2150 23.4794 20.7501 11.2992 23.6400 7.9293 61.3260 127.7408 198.0402 17.1403 113.8143 49.6230 114.1031 160.5315 113.5329 75.2717 1.6496 2.4859 18.8753 13.0376 4.2938 105.2188 347.4256 264.8577 101.4863 521.0255 2.2377 5.5888 1.0988 18.2378 2.9429 4.5229 27.5195 3.4999 11.6371 5.2321 15.5918 13.9321 9.7475 12.4335 405.5745 12.4317 7.0730 4.3858 28.8265 180.9227 138.8450 13.7068 26.3984 15.2681 17.5427 23.2071 12.1153 8.9253 2.6856 12.3261 4.7050 1.1221 1.3597 2.3958 1.9540 1.5575
temp: 298.150 k
press: 1.00000 atm
elementType: 9 9 9 8 8 8 8 6 6 6 6 6 6 6 6 6 6 6 6 6 6 6 6 6 1 1 1 1 1 1 1 1 1 1 1 1 1 1 1
symmnumber: 1
zpe: 746295.5 jmol-1
zpe.correction: 0.284249 hartree
zpe.thermalcorrener: 0.306407 hartree
zpe.thermalcorrenthalpy: 0.307351 hartree
zpe.thermalcorrgfe: 0.228695 hartree
zpe.sumelectzpe: -1255.471393 hartree
zpe.sumelectthermal: -1255.449235 hartree
zpe.sumelectthermalent: -1255.448291 hartree
zpe.sumelectthermalfe: -1255.526947 hartree
dipole: 4.9311 1.7790 0.0886
dipole: 5.2429
quadrupole: -163.2984 -131.7328 -133.0022
quadrupole: 23.8528 14.2840 -5.0489
quadrupole: -20.6206 10.9450 9.6756 23.8528 14.2840 -5.0489
hfenergy: -1255.7556422 hartree
pointgroup: C01 [X(C17H15F3O4)]
dipole: 1.9421346 0.6934599 0.0456506 debye
polarizability: 291.6245656|-10.645748|171.1088554|26.2444437|4.5215418|157.1097078 unknown
InChI: InChI=1S/C17H15F3O4/c1-11(16(21)22-2)23-13-7-9-15(10-8-13)24-14-5-3-12(4-6-14)17(18,19)20/h3-11H,1-2H3
charge 0 multiplicity 1
39 atoms
F  -6.951125 0.779464 -0.609873
F  -6.448755 0.463903 1.582651
F  -5.797922 2.360476 0.541849
O  4.022246 -0.919746 1.301879
O  -1.019809 -1.566813 -1.13638
O  4.862759 2.131152 -0.260867
O  5.913042 0.113495 -0.786828
C  4.715882 0.377696 1.380984
C  2.760698 -0.97462 0.678277
C  0.221113 -1.325406 -0.46997
C  -2.186835 -0.901941 -0.722609
C  2.084831 0.138251 0.116362
C  2.168332 -2.261245 0.650392
C  -4.638796 0.298294 -0.038135
C  0.809149 -0.045077 -0.462934
C  0.895698 -2.438099 0.076763
C  5.8942 0.16101 2.336797
C  -3.284554 -0.990469 -1.611609
C  -2.309098 -0.219384 0.514298
C  -4.508224 -0.389742 -1.268244
C  -3.538326 0.376811 0.85011
C  5.230998 0.806129 -0.007101
C  -5.92733 0.952184 0.348308
C  5.360263 2.704367 -1.539452
H  4.02794 1.155276 1.763267
H  2.534405 1.135205 0.104419
H  2.718719 -3.102908 1.080174
H  0.28461 0.802582 -0.915806
H  0.424252 -3.424317 0.040366
H  6.463126 1.098177 2.467953
H  5.516998 -0.165768 3.319883
H  6.56684 -0.614085 1.934097
H  -3.158792 -1.528737 -2.554874
H  -1.462956 -0.164439 1.204335
H  -5.35936 -0.452465 -1.952161
H  -3.642555 0.899023 1.806761
H  4.963227 2.127093 -2.390756
H  6.462337 2.67588 -1.562646
H  4.987871 3.737693 -1.548279
