program: Gaussian 09
title: 000094577
version: EM64L-G09RevD.01
frameworkgroup: C1[X(C18H11NO4)]
method: RPBEPBE
basis: SDD
operation: Freq
keyword: #p
keyword: freq=noraman
keyword: PBEPBE/SDD
title: #p freq=noraman PBEPBE/SDD
converged: NO YES NO NO
title: Mulliken charges:
elementType: O O O O N C C C C C C C C C C C C C C C C C C H H H H H H H H H H H
charge: -0.282498 -0.250713 -0.176323 -0.215872 -0.220330 0.173511 0.250456 0.243546 0.288541 0.136074 -0.038097 0.547958 -0.734626 0.202446 -0.560967 -0.050375 0.038806 -0.368893 -0.475024 -0.195576 -0.658561 -0.256592 -0.248511 0.264976 0.306901 0.296024 0.251236 0.246975 0.246881 0.293277 0.239069 0.239067 0.233042 0.234171
chargesum: 0.00000
title: Mulliken charges with hydrogens summed into heavy atoms:
elementType: O O O O N C C C C C C C C C C C C C C C C C C
charge: -0.282498 -0.250713 -0.176323 -0.215872 -0.220330 0.173511 0.250456 0.243546 0.288541 0.136074 -0.038097 0.547958 -0.469649 0.202446 -0.254066 -0.050375 0.038806 -0.072869 -0.223788 0.298280 0.112852 -0.023551 -0.014340
polarizability: 3.64005671e+02 -3.49216580e+01 2.90300718e+02 2.98888637e-02 1.76602756e-02 8.77361889e+01
1716.lowfreq: -20.7853 -7.1699 -6.3098 0.0005 0.0008 0.0010 4.6251 43.6921 63.2832
frequency: -20.5020 43.6803 63.2798 86.4562 98.0989 114.9206 185.1873 187.8756 220.2183 224.1527 237.1999 294.7919 313.3208 326.4098 329.5573 350.9195 357.7039 362.1710 397.8929 409.3792 443.9343 472.8348 491.1085 519.9837 529.5742 583.7109 588.0150 604.2008 626.2884 671.4065 686.7051 699.0431 714.6441 727.1921 740.5690 767.4999 773.4761 792.0175 804.3741 831.4606 850.4226 865.6497 905.8433 918.8118 923.7733 940.2777 965.6452 969.2676 997.0518 1004.4081 1038.5849 1047.4660 1065.4189 1093.6886 1119.3356 1121.5793 1122.8336 1146.8454 1181.5571 1192.6530 1218.3024 1238.7243 1263.8057 1281.2115 1330.6476 1340.3832 1366.8665 1370.3749 1400.5989 1415.3518 1421.9793 1437.0629 1448.2267 1450.4883 1479.7329 1483.8283 1498.7309 1504.2023 1543.8031 1560.4506 1580.7742 1594.7663 1603.4233 1615.3312 1621.6025 2990.7269 3023.7416 3078.0754 3105.8597 3125.6528 3127.3930 3141.2896 3162.4568 3170.4092 3184.9484 3192.9005
redmass: 2.2622 6.9338 6.6013 4.8348 4.9681 8.9257 5.6564 5.2021 6.6677 4.6916 1.1964 3.8640 7.2252 5.1583 5.5837 7.3881 6.1301 8.8758 7.8265 5.3622 3.7593 7.0107 7.1211 6.9968 3.4590 5.6932 7.5025 4.7035 7.3823 7.4415 6.5639 7.5960 7.3268 5.5400 8.6423 1.3219 6.0329 5.9016 3.3532 6.7271 8.5043 1.3862 6.9209 1.8832 1.4453 3.6984 7.2790 1.4089 1.3465 6.3936 2.9578 3.3438 1.4521 2.4310 1.3148 1.0411 3.0954 2.0040 1.0910 1.8418 3.2424 1.8356 5.0431 1.8076 3.9629 2.4205 2.4724 2.0255 6.4406 1.5342 4.1021 2.8455 2.5708 6.1223 1.1454 1.1293 1.0452 3.1806 6.7516 10.3736 8.3722 8.2335 9.1137 7.8837 6.9693 1.0349 1.0535 1.1027 1.1192 1.0872 1.0985 1.0906 1.0979 1.0904 1.0936 1.0944
irintensity: 14.1838 0.3903 0.7376 1.3281 2.2420 3.2126 0.0857 0.6926 1.8427 0.0986 1.2921 1.2453 3.0348 0.0766 0.6493 4.5813 0.0347 2.7843 1.0918 3.9805 5.8070 1.5065 3.0360 2.2427 15.5613 0.1778 3.7833 10.5855 5.3727 11.2217 0.1245 6.4933 3.9602 2.8386 5.8829 60.4659 0.5609 0.1366 6.3078 3.2596 26.1467 21.5085 12.5648 17.1682 25.1582 16.7047 70.2685 7.1781 0.0001 99.8438 1.9119 6.2425 4.7792 14.1994 0.0347 0.1748 51.5170 12.6176 1.2123 3.0141 105.6829 3.7404 25.6061 12.4051 209.8288 27.7435 208.8866 72.0771 22.0463 60.3159 4.4353 2.9819 4.5232 55.1204 45.0157 0.7601 20.2542 20.3228 19.6742 471.0413 368.9898 3.4544 9.1425 7.2183 0.9356 28.1886 108.1228 22.2582 23.5824 2.8940 2.0754 12.8057 35.2803 8.1737 6.8406 8.4802
temp: 298.150 k
press: 1.00000 atm
elementType: 8 8 8 8 7 6 6 6 6 6 6 6 6 6 6 6 6 6 6 6 6 6 6 1 1 1 1 1 1 1 1 1 1 1
symmnumber: 1
zpe: 649072.8 jmol-1
zpe.correction: 0.247219 hartree
zpe.thermalcorrener: 0.263672 hartree
zpe.thermalcorrenthalpy: 0.264616 hartree
zpe.thermalcorrgfe: 0.203502 hartree
zpe.sumelectzpe: -1046.614371 hartree
zpe.sumelectthermal: -1046.597918 hartree
zpe.sumelectthermalent: -1046.596973 hartree
zpe.sumelectthermalfe: -1046.658087 hartree
dipole: 8.0720 -2.3920 0.0026
dipole: 8.4189
quadrupole: -151.1681 -110.6202 -132.9960
quadrupole: 18.4200 0.0316 0.0128
quadrupole: -19.5733 20.9746 -1.4012 18.4200 0.0316 0.0128
hfenergy: -1046.8615894 hartree
pointgroup: C01 [X(C18H11N1O4)]
dipole: -3.2986567 -0.2999897 -0.00102 debye
polarizability: 374.6022578|18.0613855|279.7041317|0.025845|-0.023179|87.7361889 unknown
InChI: InChI=1S/C18H11NO4/c1-19-12-6-9-4-2-3-5-10(9)15-14(12)11(16(20)18(19)21)7-13-17(15)23-8-22-13/h2-7H,8H2,1H3
charge 0 multiplicity 1
34 atoms
O  -2.167793 2.57893 -0.00029
O  -0.310503 4.08796 0.00031
O  4.053286 1.207971 -0.001216
O  4.47584 -1.563068 -0.000437
N  2.164137 -1.924541 -0.000019
C  0.567043 -0.020656 0.000693
C  -0.808909 0.444319 0.000287
C  0.826591 -1.452023 0.000528
C  1.662518 0.903614 0.001105
C  -1.923054 -0.499987 0.000157
C  -0.956974 1.851993 -0.000084
C  -1.609736 -1.906028 0.000117
C  -0.24199 -2.34661 0.00023
C  0.134226 2.745067 0.0001
C  1.452094 2.308757 0.000696
C  3.059498 0.42425 0.002443
C  3.306872 -1.08834 -0.00003
C  -3.296281 -0.106779 0.000007
C  -2.669674 -2.865099 -0.000127
C  -1.788841 4.024417 -0.002641
C  2.416116 -3.383271 -0.000885
C  -4.319786 -1.067458 -0.000204
C  -4.007903 -2.455998 -0.000271
H  -0.064367 -3.424755 -0.000009
H  2.310687 2.984346 0.001132
H  -3.552049 0.953774 0.000068
H  -2.417481 -3.931829 -0.000187
H  -2.179266 4.491855 0.91656
H  -2.17551 4.487838 -0.925542
H  3.506323 -3.52519 -0.001311
H  1.986025 -3.852744 -0.903164
H  1.986619 -3.853768 0.901146
H  -5.366425 -0.744874 -0.000316
H  -4.812835 -3.198475 -0.000446
