program: Gaussian 09
title: 000094573
version: EM64L-G09RevD.01
frameworkgroup: C1[X(C20H16)]
method: RPBEPBE
basis: SDD
operation: Freq
keyword: #p
keyword: freq=noraman
keyword: PBEPBE/SDD
title: #p freq=noraman PBEPBE/SDD
converged: YES YES NO NO
title: Mulliken charges:
elementType: C C C C C C C C C C C C C C C C C C C C H H H H H H H H H H H H H H H H
charge: 0.064763 0.458845 0.230087 0.230087 0.221125 0.221123 0.328265 0.328262 -0.763928 -0.763925 -0.419604 -0.419603 -0.397339 -0.397338 -0.852772 -0.852771 -0.264991 -0.264993 -0.269595 -0.269595 0.243376 0.243377 0.274949 0.274948 0.246827 0.246827 0.232777 0.241765 0.231537 0.231538 0.232776 0.241764 0.228281 0.228281 0.227437 0.227437
chargesum: 0.00000
title: Mulliken charges with hydrogens summed into heavy atoms:
elementType: C C C C C C C C C C C C C C C C C C C C
charge: 0.064763 0.458845 0.230087 0.230087 0.221125 0.221123 0.328265 0.328262 -0.520552 -0.520548 -0.144655 -0.144655 -0.150512 -0.150511 -0.146694 -0.146693 -0.036711 -0.036712 -0.042157 -0.042158
polarizability: 3.50954795e+02 9.85694781e-05 2.62129438e+02 -2.91180315e+00 2.34499000e-05 9.83659285e+01
1716.lowfreq: -7.9424 -1.9809 0.0003 0.0004 0.0007 6.0579 57.0808 72.0172 119.5374
frequency: 57.0582 72.0109 119.5374 129.8093 168.0056 173.2082 181.8177 196.9667 238.4035 267.9226 269.1140 303.2467 308.7695 354.6835 377.0157 412.7532 442.9602 459.1463 489.2676 506.8212 509.7553 541.1327 542.5371 594.4605 595.2693 603.4217 616.1736 680.4128 691.6096 703.0159 744.9889 759.3973 768.0688 782.7875 791.9882 806.9580 865.8853 872.2705 886.7145 923.3780 929.3985 952.2711 970.1598 980.2240 984.0952 991.0477 1004.1306 1025.3840 1035.9919 1045.1402 1047.9571 1055.1832 1065.3883 1081.5097 1138.5156 1140.4273 1176.2997 1182.2973 1216.6353 1218.7161 1252.5017 1265.6632 1273.6728 1310.7991 1369.7751 1374.3903 1381.8991 1396.3193 1397.6407 1405.2903 1416.5043 1420.5636 1438.7157 1448.9917 1461.6153 1469.6606 1469.8748 1478.4200 1494.7446 1508.6525 1532.7750 1568.6204 1610.8822 1613.9636 1620.5953 1633.3053 2970.7981 2971.0329 3045.2745 3045.3137 3085.4736 3085.5908 3114.0479 3117.7830 3126.9709 3127.3834 3142.2796 3143.4339 3159.3350 3161.7904 3170.1924 3180.5913
redmass: 3.9534 3.9641 4.0370 3.2041 2.1151 3.2004 1.1776 1.4017 3.5130 3.7049 2.9255 3.7487 3.6897 5.6027 4.8584 3.1078 3.3927 4.5375 4.2249 5.2769 4.7945 5.1703 3.6026 3.6441 3.7698 4.0642 3.2209 5.5793 3.6183 4.7162 5.9775 1.6371 1.4295 3.5229 2.8758 2.4276 1.2746 1.8457 1.4173 4.4625 1.7721 1.3893 1.3744 1.9452 1.3395 2.2096 1.3467 3.1104 2.7040 1.5758 1.5922 3.1797 2.1404 1.9094 2.4119 1.6673 1.0878 1.1026 1.3017 2.1102 1.7628 1.5529 4.2234 1.6695 3.6204 4.6110 2.4007 1.2323 1.4038 3.3922 4.1997 3.2476 2.5100 2.5457 1.8912 1.0467 1.0466 1.0949 1.6529 3.5118 4.4009 7.7150 6.1379 5.7874 6.5721 6.7785 1.0379 1.0379 1.0971 1.0971 1.0980 1.0980 1.0917 1.0909 1.0852 1.0853 1.0895 1.0902 1.0950 1.0969 1.0984 1.0944
irintensity: 0.0004 1.3056 0.3165 2.0293 0.8735 0.1782 0.0657 3.1218 0.0004 1.2500 0.3887 0.3928 0.2103 0.0751 0.6718 10.1158 0.0061 1.8782 0.0001 1.1979 2.2876 0.4380 0.2232 0.1727 5.0922 13.3177 0.0482 2.0621 10.1393 2.2590 4.3686 3.0868 140.4299 4.8148 3.8578 2.6181 1.0943 1.3675 0.7854 3.8318 26.5390 4.0742 0.4864 8.8681 0.1143 0.5000 1.7850 0.0405 11.2287 0.0114 13.2406 5.4837 0.1896 3.3531 0.0355 5.8808 1.0834 0.0178 0.2891 3.7235 0.5956 0.3586 0.0227 0.1373 10.5251 1.8327 9.2706 4.9809 23.0693 11.3822 0.5072 4.4365 8.3136 8.0369 0.1237 0.2057 28.2678 17.7318 0.8168 3.8491 11.5146 0.6461 4.8467 3.0869 30.7056 3.3237 71.9119 19.4445 0.3997 38.4018 2.2998 32.5146 3.9488 42.5862 1.5929 0.7964 2.4153 29.5648 64.5408 2.3455 15.8036 18.6898
temp: 298.150 k
press: 1.00000 atm
elementType: 6 6 6 6 6 6 6 6 6 6 6 6 6 6 6 6 6 6 6 6 1 1 1 1 1 1 1 1 1 1 1 1 1 1 1 1
symmnumber: 1
zpe: 767480.0 jmol-1
zpe.correction: 0.292318 hartree
zpe.thermalcorrener: 0.307840 hartree
zpe.thermalcorrenthalpy: 0.308784 hartree
zpe.thermalcorrgfe: 0.250615 hartree
zpe.sumelectzpe: -770.416529 hartree
zpe.sumelectthermal: -770.401007 hartree
zpe.sumelectthermalent: -770.400063 hartree
zpe.sumelectthermalfe: -770.458232 hartree
dipole: 0.0000 0.6041 0.0000
dipole: 0.6041
quadrupole: -98.7204 -102.1348 -123.6925
quadrupole: 0.0000 -1.3114 0.0000
quadrupole: 9.4621 6.0478 -15.5099 0.0000 -1.3114 0.0000
hfenergy: -770.7088471 hartree
pointgroup: C01 [X(C20H16)]
dipole: -0.0000045 -0.2376576 0.0000075 debye
polarizability: 350.9175416|-0.0009352|262.1294383|4.2292998|-0.0011984|98.4031818 unknown
InChI: InChI=1S/C20H16/c1-13-11-15-12-14(2)17-8-4-6-10-19(17)20(15)18-9-5-3-7-16(13)18/h3-12H,1-2H3
charge 0 multiplicity 1
36 atoms
C  0.000002 -0.117551 0.000016
C  -0.000017 -1.548052 0.000026
C  1.297149 0.553597 -0.10692
C  -1.29713 0.553631 0.106943
C  2.517964 -0.206997 0.095859
C  -2.517963 -0.206937 -0.095821
C  2.462687 -1.650314 0.267569
C  -2.462722 -1.650258 -0.267513
C  1.232375 -2.278142 0.147679
C  -1.232425 -2.278115 -0.147618
C  1.439384 1.925423 -0.504042
C  -1.439332 1.925466 0.504044
C  3.779178 0.469189 0.055427
C  -3.779161 0.469279 -0.055391
C  3.723198 -2.459509 0.508016
C  -3.723256 -2.459424 -0.507942
C  2.689443 2.552506 -0.574485
C  -2.689375 2.55258 0.574485
C  3.871981 1.830719 -0.251106
C  -3.871932 1.830815 0.251122
H  1.175187 -3.373061 0.192249
H  -1.175265 -3.373035 -0.192177
H  0.556698 2.483361 -0.823945
H  -0.556632 2.483389 0.823935
H  4.69366 -0.102447 0.241826
H  -4.693658 -0.10234 -0.241775
H  4.245418 -2.136377 1.428599
H  3.483353 -3.530262 0.616385
H  4.444007 -2.358919 -0.326166
H  -4.444035 -2.358839 0.326266
H  -4.2455 -2.136262 -1.4285
H  -3.483432 -3.530179 -0.616344
H  2.755744 3.596912 -0.898947
H  -2.755651 3.596992 0.89893
H  4.848043 2.327022 -0.283151
H  -4.847983 2.32714 0.283167
