program: Gaussian 09
title: 000009266
version: EM64L-G09RevD.01
frameworkgroup: C1[X(C8H16)]
method: RPBEPBE
basis: SDD
operation: Freq
keyword: #p
keyword: freq=noraman
keyword: PBEPBE/SDD
title: #p freq=noraman PBEPBE/SDD
converged: YES YES NO NO
title: Mulliken charges:
elementType: C C C C C C C C H H H H H H H H H H H H H H H H
charge: -0.363667 -0.420279 -0.391802 -0.363647 -0.406602 -0.391866 -0.357810 -0.406533 0.190291 0.190697 0.196696 0.193756 0.197348 0.200455 0.190696 0.190286 0.190878 0.194850 0.200469 0.197341 0.186276 0.196452 0.194843 0.190875
chargesum: 0.00000
title: Mulliken charges with hydrogens summed into heavy atoms:
elementType: C C C C C C C C
charge: 0.017321 -0.029828 0.006001 0.017335 -0.020875 0.005943 0.024917 -0.020815
polarizability: 8.77727520e+01 -3.70738069e-04 8.66791208e+01 2.66817364e-02 8.64240184e-05 7.31017740e+01
1716.lowfreq: -22.4260 -11.2983 -0.0010 -0.0008 -0.0005 8.1859 115.6533 194.1618 200.8200
frequency: 114.4424 194.1571 200.7923 230.7449 289.2628 316.5756 354.9369 431.7200 465.9114 500.6728 687.7431 752.1114 759.9157 788.5704 801.4622 848.7720 867.4260 947.3688 962.1650 970.4314 983.2386 1042.2939 1091.2060 1106.5783 1110.0233 1135.5113 1137.5348 1174.2426 1215.8522 1225.0177 1248.8077 1257.1534 1284.1032 1286.0810 1323.1384 1336.6923 1337.2362 1344.1406 1348.5013 1362.7516 1365.2115 1370.3654 1458.0522 1458.3904 1463.6373 1465.4785 1467.8403 1469.7565 1483.6428 1491.3641 2947.1781 2948.6679 2951.8082 2962.7080 2963.9794 2965.4215 2976.5057 2981.2358 2997.8964 2998.7774 3005.2170 3015.2194 3016.0259 3025.7180 3027.8563 3041.2865
redmass: 1.9352 2.0702 2.1144 2.5295 3.0389 1.8288 1.7755 1.9702 1.6292 1.8173 1.8312 1.8023 1.3980 2.6504 2.0136 1.7226 1.7422 1.5937 1.6385 2.3391 1.9824 2.3287 1.1638 1.6238 2.1888 2.0353 2.4970 1.1291 1.2906 1.2632 1.1958 1.2535 1.1823 1.1107 1.3616 1.3225 1.4462 1.4109 1.3483 1.4230 1.3402 1.4403 1.0812 1.0767 1.0891 1.0920 1.0823 1.0866 1.0795 1.0829 1.0603 1.0601 1.0598 1.0651 1.0610 1.0630 1.0644 1.0669 1.0964 1.1014 1.0943 1.0994 1.1013 1.0989 1.1015 1.0982
irintensity: 0.1106 0.0639 0.4108 0.1807 0.2532 0.0647 0.3486 0.5894 0.6174 2.0669 1.1133 0.3813 13.7618 3.4357 0.0046 4.1302 1.2704 0.9060 4.0311 0.1220 1.9105 4.8645 0.2136 0.3936 1.2438 0.0002 0.5620 0.0993 0.3122 0.9428 0.3541 0.7515 1.1496 0.1012 0.2005 0.0566 0.2397 0.0009 0.2063 0.1713 0.2914 0.1321 2.6356 0.0121 8.5986 13.6850 10.7978 7.1055 5.5026 31.3150 44.4996 8.0419 24.6743 39.2537 4.7919 53.8040 63.7533 27.9227 39.0260 0.7660 95.9772 45.9185 72.9232 60.0355 109.4934 118.8435
temp: 298.150 k
press: 1.00000 atm
elementType: 6 6 6 6 6 6 6 6 1 1 1 1 1 1 1 1 1 1 1 1 1 1 1 1
symmnumber: 1
zpe: 587094.4 jmol-1
zpe.correction: 0.223612 hartree
zpe.thermalcorrener: 0.231863 hartree
zpe.thermalcorrenthalpy: 0.232807 hartree
zpe.thermalcorrgfe: 0.191508 hartree
zpe.sumelectzpe: -313.765141 hartree
zpe.sumelectthermal: -313.756891 hartree
zpe.sumelectthermalent: -313.755946 hartree
zpe.sumelectthermalfe: -313.797246 hartree
dipole: -0.0209 0.0001 -0.0197
dipole: 0.0287
quadrupole: -52.4462 -52.3307 -52.1954
quadrupole: 0.0001 0.0601 0.0000
quadrupole: -0.1221 -0.0066 0.1287 0.0001 0.0601 0.0000
hfenergy: -313.9887534 hartree
pointgroup: C01 [X(C8H16)]
dipole: 0.0081809 0.0000589 0.0077699 debye
dipolederiv: 0.0744177 -0.0357969 -0.0087902 -0.0302741 0.0469504 0.0031204 -0.0227282 -0.0037771 0.1059061 0.09528 0.0000139 -0.025933 -0.0000006 0.0955127 -0.000028 -0.0215623 -0.0000235 0.1473701 0.0225503 -0.0037049 0.0099079 -0.0047267 0.1097786 -0.0280414 -0.0069346 -0.0232328 0.0805931 0.0743222 0.0358037 -0.0087713 0.030283 0.0470589 -0.003149 -0.0227261 0.0037189 0.1058866 0.1166593 0.0201472 0.0150271 0.0234371 0.0635377 -0.0314107 0.0097043 -0.0335901 0.1140797 0.0225653 0.0035858 0.009806 0.004605 0.1097501 0.0281226 -0.0070349 0.0232593 0.0806446 0.0818056 -0.0000126 0.0391826 0.0000123 0.071798 0.0000189 0.0542537 0.0000569 0.0767636 0.1167165 -0.0200811 0.0149663 -0.0233714 0.0634319 0.0314262 0.0096111 0.0336161 0.1140356 -0.1092234 0.1245967 -0.0120889 0.126079 -0.1261986 -0.0025939 0.017095 -0.0371202 0.0725733 0.0315272 -0.0527719 0.0822972 -0.0432272 0.0585912 -0.0182111 0.0570149 0.0232288 -0.1686789 -0.1659765 -0.0001063 -0.1252865 -0.0001047 0.0132003 -0.0000785 -0.1672099 -0.000112 -0.0128262 0.0370485 0.000013 0.0542004 0.0000032 0.0075044 0.000065 0.130796 0.0001163 -0.1675658 0.0006149 -0.0162862 0.031941 -0.0221843 0.0392417 0.1411134 0.0285223 0.1040265 -0.1161676 0.0114968 0.0033423 0.0039499 0.0006768 -0.2198762 -0.113553 -0.0124424 -0.0737474 0.044332 0.0314023 0.0527288 0.0822966 0.0431984 0.0587353 0.0183934 0.0570843 -0.0230771 -0.1686682 -0.1088892 -0.1245785 -0.0121423 -0.1260516 -0.1265545 0.0025173 0.0170009 0.0370847 0.0725807 -0.1073242 -0.0176977 -0.1202 0.0262855 0.0642944 -0.0060499 -0.1421451 -0.0527346 -0.084811 0.0287563 -0.0238807 0.0406769 -0.0594199 -0.1365971 0.1023493 0.0873975 0.1231034 -0.0374834 0.0115084 -0.0030022 0.0037982 -0.0003568 -0.2199632 0.1134588 -0.0125488 0.073604 0.044413 0.0005271 0.0162372 0.0322046 0.0221415 0.0393814 -0.141007 0.0287456 -0.1039158 -0.1162692 -0.1998843 -0.0001307 0.135567 -0.0001415 0.0054742 0.0000854 0.1074966 0.000078 0.0232048 0.0127496 -0.0000024 -0.1632903 0.0000009 0.0071318 -0.0001199 -0.1347967 -0.0001137 -0.0876349 0.0285476 0.0242044 0.0408762 0.059741 -0.1365019 -0.1022414 0.0876223 -0.1229221 -0.0373704 -0.1071981 0.0173789 -0.1201956 -0.0266049 0.0643182 0.0058132 -0.1422155 0.0524736 -0.0849075 unknown
polarizability: 87.7724232|0.001379|86.6791224|0.0742438|0.0001503|73.1021012 unknown
InChI: InChI=1S/C8H16/c1-2-4-6-8-7-5-3-1/h1-8H2
charge 0 multiplicity 1
24 atoms
C  1.197621 -1.333146 0.325699
C  1.955596 0.001323 0.08767
C  0.016552 -1.620432 -0.647837
C  1.195768 1.334687 0.325994
C  -1.401553 -1.322188 -0.083639
C  0.014449 1.620652 -0.647633
C  -1.586289 -0.001088 0.700647
C  -1.403394 1.320098 -0.083928
H  1.944131 -2.147397 0.2299
H  0.83993 -1.377694 1.374833
H  2.855013 0.001861 0.738615
H  2.333881 0.001705 -0.957057
H  0.180436 -1.058614 -1.58691
H  0.034871 -2.690765 -0.936239
H  0.837896 1.378471 1.375097
H  1.941178 2.14998 0.230506
H  -2.132695 -1.356165 -0.918484
H  -1.677662 -2.152064 0.600172
H  0.031261 2.691147 -0.935521
H  0.179436 1.059563 -1.586955
H  -2.612791 -0.001757 1.12292
H  -0.907811 -0.000516 1.577548
H  -1.681165 2.149673 0.599569
H  -2.13426 1.352666 -0.919069
