program: Gaussian 09
title: 000094556
version: EM64L-G09RevD.01
frameworkgroup: C1[X(C6H12Cl2O5S2)]
method: RPBEPBE
basis: SDD
operation: Freq
keyword: #p
keyword: freq=noraman
keyword: PBEPBE/SDD
title: #p freq=noraman PBEPBE/SDD
converged: YES YES NO NO
title: Mulliken charges:
elementType: Cl Cl S S O O O O O C C C C C C H H H H H H H H H H H H
charge: -0.027828 -0.027855 0.919787 0.919923 -0.161094 -0.544804 -0.610816 -0.610973 -0.544777 -0.401393 -0.401545 -0.527728 -0.527680 -0.534468 -0.534470 0.316866 0.288224 0.317004 0.288209 0.330993 0.279939 0.330782 0.279922 0.294691 0.297197 0.294711 0.297184
chargesum: 0.00000
title: Mulliken charges with hydrogens summed into heavy atoms:
elementType: Cl Cl S S O O O O O C C C C C C
charge: -0.027828 -0.027855 0.919787 0.919923 -0.161094 -0.544804 -0.610816 -0.610973 -0.544777 0.203696 0.203668 0.083204 0.083024 0.057419 0.057425
polarizability: 1.78532395e+02 -8.83875560e-03 1.86083798e+02 2.51315871e-01 1.05100377e-02 1.22585879e+02
1716.lowfreq: -11.0774 -9.3838 -5.6826 -0.0020 -0.0015 -0.0009 12.7327 26.9926 36.9442
frequency: 12.4366 26.9493 36.9224 61.4525 64.2822 74.2653 75.4139 80.5934 81.6249 131.7202 145.6082 151.2652 169.7797 203.3312 207.9403 220.1370 230.2526 234.9367 252.3186 257.8027 263.6973 323.8193 350.9861 403.4689 470.1205 489.0394 516.9513 548.5231 570.4439 683.8911 684.3454 776.0539 782.7104 800.3385 803.9694 848.5644 857.0689 872.6188 901.5278 921.9456 983.2558 995.0466 1055.0779 1062.3071 1073.2652 1105.6432 1109.3983 1199.9735 1214.9714 1223.8056 1228.4617 1265.5106 1266.2670 1275.8874 1283.4156 1294.1732 1302.5240 1396.8209 1402.0560 1428.1700 1432.4408 1468.4085 1470.4770 3041.9518 3042.1361 3044.6757 3046.2297 3074.9714 3075.0052 3138.4477 3138.5165 3164.2971 3164.3512 3169.9945 3170.5675
redmass: 16.9892 12.5375 11.2942 2.8999 5.3012 7.5246 4.0932 2.8903 6.0552 6.8343 7.1284 7.9752 9.5990 9.0812 8.1615 4.0773 3.5278 4.0648 5.2254 3.7641 3.6718 11.1722 7.2909 8.5142 9.1283 10.5928 5.3695 6.6419 6.9568 6.6686 6.6892 9.2104 8.5200 1.2046 1.2524 1.8071 2.8071 4.3816 2.6414 1.6820 1.6658 1.7939 3.9653 4.4638 4.3198 1.0657 1.0826 1.1095 1.1597 1.1587 1.1952 1.1683 1.2049 1.1293 1.2349 1.1665 1.2049 1.0979 1.0963 1.1060 1.1036 1.0942 1.0944 1.0544 1.0552 1.0544 1.0533 1.0558 1.0558 1.1120 1.1120 1.1123 1.1123 1.1163 1.1175
irintensity: 0.0006 0.0220 0.1346 1.8142 1.2393 14.4678 6.2180 3.2079 0.0047 4.1880 1.6126 13.9155 10.0663 1.0986 16.1337 9.7725 1.7763 22.4801 2.0253 0.1075 40.9740 70.2659 10.9032 59.2556 103.1417 5.8291 1.3838 0.6450 24.3068 9.3525 25.0987 0.1370 97.1671 6.6596 0.4197 46.1849 48.9404 7.9546 123.9780 9.5543 59.8112 5.6591 156.9538 26.0197 157.2785 28.3224 0.6438 15.5882 7.9750 0.1393 25.7107 0.6627 2.7962 0.0973 9.6458 1.2202 21.0789 43.3893 0.0522 11.7391 2.7705 19.3315 1.1219 1.6989 1.4038 0.4664 62.0781 5.7134 2.9572 4.6391 10.6251 0.2523 0.6454 1.8962 0.0395
temp: 298.150 k
press: 1.00000 atm
elementType: 17 17 16 16 8 8 8 8 8 6 6 6 6 6 6 1 1 1 1 1 1 1 1 1 1 1 1
symmnumber: 1
zpe: 486865.9 jmol-1
zpe.correction: 0.185437 hartree
zpe.thermalcorrener: 0.205678 hartree
zpe.thermalcorrenthalpy: 0.206622 hartree
zpe.thermalcorrgfe: 0.132440 hartree
zpe.sumelectzpe: -2326.629048 hartree
zpe.sumelectthermal: -2326.608807 hartree
zpe.sumelectthermalent: -2326.607863 hartree
zpe.sumelectthermalfe: -2326.682046 hartree
dipole: 0.0023 -1.8939 0.0012
dipole: 1.8939
quadrupole: -130.3579 -123.8030 -130.8193
quadrupole: 0.0013 14.7377 -0.0073
quadrupole: -2.0312 4.5238 -2.4926 0.0013 14.7377 -0.0073
hfenergy: -2326.8144856 hartree
pointgroup: C01 [X(C6H12Cl2O5S2)]
dipole: -0.0012093 -0.7451163 0.0011275 debye
polarizability: 178.357258|0.0194719|186.0834342|3.1354536|-0.1503328|122.7613803 unknown
InChI: InChI=1S/C6H12Cl2O5S2/c7-1-3-14(9,10)5-13-6-15(11,12)4-2-8/h1-6H2
charge 0 multiplicity 1
27 atoms
Cl 3.090107 3.562044 1.146413
Cl -3.08905 3.55814 -1.159952
S  1.905472 -0.470067 -0.570554
S  -1.905487 -0.466695 0.574587
O  -0.00086 -2.619457 0.007362
O  3.320936 -0.956512 -1.22104
O  0.701199 0.09732 -1.551382
O  -0.700108 0.105733 1.551044
O  -3.320213 -0.950059 1.228929
C  1.121053 -1.959163 0.581477
C  -1.121299 -1.960552 -0.570971
C  2.277435 0.969692 0.709698
C  -2.277886 0.967155 -0.71205
C  2.769696 2.165618 -0.085506
C  -2.769943 2.166667 0.077893
H  0.870339 -1.425183 1.510516
H  1.946382 -2.682837 0.627765
H  -0.868582 -1.429867 -1.50137
H  -1.947079 -2.683756 -0.615943
H  1.304865 1.120161 1.205734
H  3.040566 0.549386 1.383486
H  -1.305376 1.115569 -1.208847
H  -3.04103 0.544083 -1.384085
H  2.015129 2.544703 -0.789024
H  3.727793 1.98031 -0.591118
H  -2.0155 2.548236 0.780211
H  -3.728358 1.983931 0.583827
