program: Gaussian 09
title: 000094511
version: EM64L-G09RevD.01
frameworkgroup: C1[X(C7H3Cl3O3)]
method: RPBEPBE
basis: SDD
operation: Freq
keyword: #p
keyword: freq=noraman
keyword: PBEPBE/SDD
title: #p freq=noraman PBEPBE/SDD
converged: YES YES NO NO
title: Mulliken charges:
elementType: Cl Cl Cl O O O C C C C C C C H H H
charge: 0.069644 0.016341 0.010577 -0.370999 -0.554484 -0.194836 0.317033 0.265026 -0.298342 -0.270176 -0.085017 -0.205199 0.171682 0.290732 0.421418 0.416600
chargesum: 0.00000
title: Mulliken charges with hydrogens summed into heavy atoms:
elementType: Cl Cl Cl O O O C C C C C C C
charge: 0.069644 0.016341 0.010577 0.050419 -0.137885 -0.194836 0.317033 0.265026 -0.298342 -0.270176 -0.085017 0.085534 0.171682
polarizability: 1.67549405e+02 2.86526979e+00 1.47560991e+02 2.97297785e-02 2.00666581e-03 4.20071552e+01
1716.lowfreq: -2.6630 -1.8001 -0.0017 -0.0011 0.0010 4.6061 30.5440 60.6386 97.4406
frequency: 30.5195 60.6383 97.4377 140.7273 181.7876 193.6035 232.5405 264.3454 306.4601 333.5290 344.9279 358.7641 398.0738 412.8630 465.3469 525.6226 564.9832 596.7178 623.4618 644.0347 685.4381 716.5061 776.3267 805.3452 806.1626 879.8435 892.4211 981.9576 1108.4854 1162.3788 1228.9521 1240.7007 1312.4117 1356.3877 1396.7153 1456.6020 1558.7987 1602.8602 1679.5402 3120.4803 3183.3294 3559.9446
redmass: 13.6788 18.8874 10.1070 9.9330 21.9384 17.5352 21.0414 6.3153 24.0349 16.8184 11.2182 14.4474 7.9580 8.9891 3.1568 8.3982 1.2981 5.1406 10.3248 5.3425 6.3227 12.0023 8.4747 1.1327 8.0404 1.4216 9.2367 5.6091 2.5462 1.9799 2.8074 3.5437 3.2992 7.6476 3.3148 2.8776 4.8517 4.7809 9.2504 1.0660 1.0935 1.0652
irintensity: 1.6396 0.6064 1.5386 0.0579 0.3220 0.6337 0.4319 2.9717 0.3266 1.0743 0.0320 0.8871 0.8445 6.4922 1.4140 17.8835 181.9819 46.0037 0.9212 6.5550 1.0009 102.4626 29.2236 154.7547 31.9210 13.1201 14.0278 145.2258 133.0603 80.2078 83.2231 59.1346 79.1586 47.0939 358.1864 14.8188 3.0794 74.6858 318.1568 429.9145 2.4609 81.1995
temp: 298.150 k
press: 1.00000 atm
elementType: 17 17 17 8 8 8 6 6 6 6 6 6 6 1 1 1
symmnumber: 1
zpe: 229012.9 jmol-1
zpe.correction: 0.087226 hartree
zpe.thermalcorrener: 0.099221 hartree
zpe.thermalcorrenthalpy: 0.100165 hartree
zpe.thermalcorrgfe: 0.047231 hartree
zpe.sumelectzpe: -1873.458750 hartree
zpe.sumelectthermal: -1873.446755 hartree
zpe.sumelectthermalent: -1873.445811 hartree
zpe.sumelectthermalfe: -1873.498745 hartree
dipole: -1.1743 1.7208 -0.0073
dipole: 2.0833
quadrupole: -106.7610 -79.0812 -94.9350
quadrupole: -5.3725 -0.0243 -0.0297
quadrupole: -13.1686 14.5112 -1.3426 -5.3725 -0.0243 -0.0297
hfenergy: -1873.5459764 hartree
pointgroup: C01 [X(C7H3Cl3O3)]
dipole: 0.5487446 0.6064503 -0.0536254 debye
dipolederiv: -0.0843764 0.2586077 -0.0059525 0.2103117 -0.5542773 0.014702 -0.0037337 0.0119591 0.0197164 -0.2589151 0.34038 -0.0037113 0.3010418 -0.5546206 0.0091174 -0.0020231 0.0074541 -0.0204571 -0.2809578 -0.3023337 0.0247268 -0.3293212 -0.4671943 0.0339584 0.0258654 0.0325738 -0.0211914 -0.6666655 -0.5841949 0.0385315 -0.3766478 -1.0926791 0.0487305 0.0298245 0.0578257 -0.375095 -0.7766874 -0.4230332 0.0335738 -0.4830306 -0.9801576 0.0460761 0.0373339 0.0432136 -0.4863579 -1.0183059 0.2917983 0.0180552 0.2826921 -0.647132 0.0049894 0.0186332 0.0047569 -0.2934895 -1.015415 0.1570467 0.039119 -0.1840186 -0.3035668 0.0223275 0.0543645 0.0066123 0.0069809 0.4413528 0.7976724 -0.0487712 0.406209 0.7630936 -0.0465945 -0.0310668 -0.0645874 0.1348241 0.5200433 -0.6415446 0.0015994 -0.0866622 0.6481538 -0.0246844 -0.0232702 0.0004414 -0.0422223 0.2569997 -0.9628214 0.024755 -0.5361491 0.6933639 -0.0097831 0.0062859 0.0099844 -0.1084566 0.0313744 0.7808794 -0.0380318 0.7465238 0.4269112 -0.0549644 -0.0363016 -0.056535 -0.0705178 -0.0758869 0.0188835 0.0021095 -0.1607041 0.012801 0.0060626 0.0096355 -0.0020133 -0.0109399 2.0171601 0.0804348 -0.0809635 0.1053443 1.2887739 -0.0551248 -0.0825597 -0.0528032 0.2795348 0.0430452 0.0080563 0.0050824 0.0039103 0.103723 0.002317 0.0053077 0.0021125 0.1624354 0.6145837 0.1079629 -0.0143507 -0.0705387 0.3670851 0.0042314 -0.0072837 -0.0037934 0.3961812 0.2526508 0.072206 0.0042283 0.1710393 0.2957223 -0.0013612 -0.0010117 0.0027984 0.4290547 unknown
polarizability: 149.7563904|-7.3107032|164.9352571|-4.5408768|-4.9682351|42.4259029 unknown
InChI: InChI=1S/C7H3Cl3O3/c8-2-1-3(9)6(11)4(5(2)10)7(12)13/h1,11-12H
charge 0 multiplicity 1
16 atoms
Cl 0.758551 -2.882978 0.046354
Cl -2.359506 2.735391 -0.051101
Cl -2.437578 -2.762431 0.186439
O  0.55026 2.439072 -0.172518
O  2.724388 1.265647 -0.223473
O  2.970251 -1.026162 -0.124345
C  0.695167 -0.048809 -0.070609
C  -0.032057 1.203143 -0.092006
C  -0.051823 -1.274551 0.015493
C  -1.452872 1.177602 -0.025843
C  -1.456843 -1.246928 0.07786
C  -2.159638 -0.022898 0.057676
C  2.178064 -0.067738 -0.135554
H  -3.251202 -0.019167 0.107001
H  1.558816 2.333293 -0.215503
H  3.714122 1.210913 -0.263871
