program: Gaussian 09
title: 000094508
version: EM64L-G09RevD.01
frameworkgroup: C1[X(C7H8N4O2)]
method: RPBEPBE
basis: SDD
operation: Freq
keyword: #pfreq=noraman
keyword: PBEPBE/SDD
title: #p freq=noraman PBEPBE/SDD
converged: YES YES YES YES
title: Mulliken charges:
elementType: O O N N N N C C C C C C C H H H H H H H H
charge: -0.222043 -0.220066 -0.403555 0.019942 0.025880 -0.136279 0.491873 0.386417 -0.388495 -0.349160 -0.338017 -0.339038 -0.648989 0.236456 0.279557 0.287451 0.286994 0.310882 0.240192 0.239804 0.240193
chargesum: 0.00000
title: Mulliken charges with hydrogens summed into heavy atoms:
elementType: O O N N N N C C C C C C C
charge: -0.222043 -0.220066 -0.092672 0.019942 0.025880 -0.136279 0.491873 0.386417 -0.152040 -0.069603 -0.050566 -0.052044 0.071200
polarizability: 2.69495155e+02 1.16932585e+00 1.14227813e+02 7.60089438e-04 -2.12672278e-04 4.79978971e+01
1716.lowfreq: -166.9515 -9.1326 -8.9640 -0.0009 -0.0008 -0.0004 4.1885 47.9593 74.3769
frequency: -166.9511 47.9410 74.3747 87.9076 114.1223 160.2187 211.9400 280.3517 281.0747 322.0501 322.7523 417.2818 468.3359 500.4152 502.3546 565.9052 628.6886 657.1546 665.9331 704.3267 734.6770 775.3468 831.7859 848.1614 863.4367 980.9875 993.8840 999.2422 1010.4132 1044.5133 1069.4948 1097.2349 1115.1076 1160.2898 1177.4134 1225.2976 1263.4622 1299.9342 1351.5805 1370.7140 1398.0306 1421.5014 1437.3616 1463.7820 1468.8748 1475.2772 1512.4595 1592.2601 1617.7960 2975.0595 3062.1413 3121.4269 3138.4279 3175.7461 3185.2766 3195.1138 3393.7681
redmass: 1.0934 5.8733 7.0033 4.7321 4.0417 6.7182 6.5963 9.6805 5.0439 4.1580 4.2401 3.0067 7.1585 3.1032 7.7243 4.3548 6.8942 7.5514 4.6602 1.2817 4.6666 8.7031 1.3131 5.1192 1.5810 1.3367 3.0057 1.3332 4.3332 1.3115 2.4882 3.1078 1.2736 2.1895 1.4872 5.2263 1.8671 1.3828 7.7535 2.7630 2.5139 2.0424 3.6117 1.2971 1.0458 1.8963 2.9574 6.9567 6.4177 1.0351 1.1002 1.0989 1.0905 1.0889 1.0948 1.0968 1.0751
irintensity: 1.3504 0.3762 0.0200 1.0737 1.8179 2.8706 4.5757 2.5617 3.2192 7.0209 27.0743 0.0188 11.0509 16.3319 3.3092 5.3331 0.7192 0.3057 17.8463 95.2289 2.2700 23.5919 23.0634 0.2066 69.6601 0.8664 1.9268 0.0809 16.7587 2.0043 185.3831 23.5221 37.1616 256.9344 60.6869 559.4768 135.2633 7.0685 88.3313 38.3710 35.4646 51.3916 21.4211 11.2585 15.1094 19.5910 183.3991 7.8238 349.5925 50.6091 26.8531 24.7376 9.1993 0.4483 1.6959 1.6385 25.3618
temp: 298.150 k
press: 1.00000 atm
elementType: 8 8 7 7 7 7 6 6 6 6 6 6 6 1 1 1 1 1 1 1 1
symmnumber: 1
zpe: 399914.1 jmol-1
zpe.correction: 0.152319 hartree
zpe.thermalcorrener: 0.163550 hartree
zpe.thermalcorrenthalpy: 0.164494 hartree
zpe.thermalcorrgfe: 0.114134 hartree
zpe.sumelectzpe: -639.913348 hartree
zpe.sumelectthermal: -639.902117 hartree
zpe.sumelectthermalent: -639.901173 hartree
zpe.sumelectthermalfe: -639.951533 hartree
dipole: -6.9268 1.1272 0.0002
dipole: 7.0179
quadrupole: -91.4545 -69.0177 -76.3748
quadrupole: 7.1737 0.0005 0.0002
quadrupole: -12.5055 9.9313 2.5742 7.1737 0.0005 0.0002
hfenergy: -640.0656671 hartree
pointgroup: C01 [X(C7H8N4O2)]
dipole: -2.7290695 0.4190158 0.0004101 debye
dipolederiv: -1.033314 -0.1859964 0.0001236 -0.4364188 -0.5957163 0.0000807 0.0002685 0.0001237 -0.2423512 -0.7884211 0.1980958 0.0000445 0.5140253 -0.7733105 0.0000529 0.0000755 -0.0000112 -0.2411029 -2.0282812 -0.0577473 0.0002365 -0.9546898 -0.1159127 0.0000513 0.0005109 -0.0000516 -0.2975556 2.4677041 -0.1296225 -0.0003039 -0.2433097 1.1050469 -0.0001172 -0.000388 -0.0001111 0.191094 1.4191185 0.2653448 -0.0002445 1.070501 -0.0216645 -0.0001264 -0.0003893 -0.0000124 0.0085089 -1.1940219 -0.1780299 0.00017 0.5718444 0.0195946 -0.0001446 -0.0001038 -0.0000704 -0.2237057 2.0147897 -0.1047295 -0.0002056 -0.3876733 0.1241187 0.0000776 -0.0001171 0.0000349 0.1299198 -1.2967492 0.1205414 0.000175 0.2656285 -0.1074778 -0.0000199 0.0001325 0.000002 0.0239691 -0.8041365 -0.0160202 0.0000792 -0.3863295 0.0849909 0.0000189 0.000134 -0.000032 -0.2003168 -0.5035159 0.0947125 0.0000353 0.6131998 -0.0879646 -0.0000809 -0.0001149 -0.0000225 -0.1701556 0.5224881 -0.0477326 -0.0000668 -0.3863777 0.0723438 0.0000361 -0.0000305 -0.0000111 -0.0827324 0.5342282 -0.0553242 -0.0000647 0.1676323 0.0230307 -0.0000355 -0.000122 0.0000006 -0.0861211 0.5138114 0.0664306 -0.0000639 -0.1233733 0.0336959 0.0000644 0.0000029 0.0000437 0.1767695 0.0369155 0.0882742 0.0000055 0.0703007 -0.0490636 0.0000121 0.0000112 0.0000111 0.1678349 0.0581955 -0.0593336 0.0000147 -0.0610332 0.0388668 0.0000176 0.0000171 0.0000189 0.1663449 0.0821335 -0.0671979 0.0000148 -0.0207597 0.0732087 0.00001 0.0000025 0.0000226 0.1689369 0.1038739 0.0484471 0.000001 0.0068936 0.0442014 0.0000136 0.0000178 0.0000081 0.1662798 0.0962728 -0.0055765 0.0000293 -0.132236 0.0691162 0.000088 0.0000147 0.0000756 0.3265821 -0.027091 -0.0083554 0.0474187 -0.1249199 0.0067959 -0.1094596 -0.0440383 -0.1194699 -0.0501077 -0.1469031 0.0421779 0.0000199 0.1019554 0.0491532 0.0000101 0.0000013 0.0000177 0.1181651 -0.0270974 -0.0083582 -0.0474187 -0.1248602 0.0069465 0.1094508 0.0441151 0.1194332 -0.0502561 unknown
polarizability: 269.4617127|2.5608547|114.2612495|-0.0304297|-0.0103178|47.9979028 unknown
InChI: InChI=1S/C7H8N4O2/c1-8-10-9-6-2-4-7(5-3-6)11(12)13/h2-5,9H,1H3
charge 0 multiplicity 1
21 atoms
O  4.219281 0.728171 -0.000669
O  3.817076 -1.520688 -0.000264
N  -2.165231 0.746508 0.000182
N  3.417315 -0.289022 -0.000254
N  -3.10788 -0.26206 0.000588
N  -4.314367 0.225544 0.000558
C  -0.795331 0.462611 0.000092
C  1.968919 -0.029854 -0.000129
C  0.125421 1.550441 -0.000118
C  -0.313144 -0.878824 0.000203
C  1.506203 1.306537 -0.000239
C  1.067441 -1.12109 0.000096
C  -5.344306 -0.849056 0.001046
H  -0.245807 2.581798 -0.000174
H  -1.028634 -1.703582 0.000374
H  2.231507 2.12407 -0.000405
H  1.465734 -2.139115 0.000173
H  -2.514314 1.717644 -0.000067
H  -5.256923 -1.493703 -0.893829
H  -6.330667 -0.362119 0.001011
H  -5.256691 -1.493113 0.896323
