program: Gaussian 09
title: 000094523
version: EM64L-G09RevD.01
frameworkgroup: C1[X(C14H14F3NO2)]
method: RPBEPBE
basis: SDD
operation: Freq
keyword: #p
keyword: freq=noraman
keyword: PBEPBE/SDD
title: #p freq=noraman PBEPBE/SDD
converged: NO YES NO NO
title: Mulliken charges:
elementType: F F F O O N C C C C C C C C C C C C C C H H H H H H H H H H H H H H
charge: -0.165395 -0.153693 -0.153713 -0.253523 -0.196647 -0.153064 0.502994 -0.396206 -0.394985 0.219003 0.186210 -0.542374 -0.396460 -0.370610 0.268153 -0.657957 -0.657945 -0.411010 0.249465 0.127285 0.235592 0.228360 0.229551 0.230377 0.272672 0.235905 0.269513 0.246049 0.224172 0.217877 0.240310 0.221196 0.222525 0.276371
chargesum: 0.00000
title: Mulliken charges with hydrogens summed into heavy atoms:
elementType: F F F O O N C C C C C C C C C C C C C C
charge: -0.165395 -0.153693 -0.153713 -0.253523 -0.196647 -0.153064 0.502994 0.067746 0.064943 0.219003 0.186210 -0.269702 -0.160554 -0.101097 0.268153 0.030141 0.026087 -0.134639 0.249465 0.127285
polarizability: 3.07647384e+02 -4.17664393e+01 1.90047981e+02 4.94245734e+00 -5.53307478e+00 9.48592043e+01
1716.lowfreq: -44.7133 -7.1742 -5.6242 -0.0002 0.0006 0.0006 3.4809 32.4983 46.9744
frequency: -44.6932 32.4982 46.9721 74.0584 75.1264 104.5411 112.5088 133.4112 146.2488 189.4190 212.3057 217.0287 237.3791 246.5560 252.5273 288.0773 307.9605 314.1033 343.0757 372.6324 416.0448 444.0417 453.5527 461.4565 473.4271 498.6812 538.2180 562.9332 606.8847 613.6530 646.8371 661.9050 663.0233 667.4045 736.9439 743.4512 767.8039 787.6714 792.9823 803.4777 850.4158 856.6629 857.1175 902.6159 926.4642 951.6729 963.8910 988.3937 1017.0241 1020.7798 1073.9633 1076.9704 1095.0380 1095.8979 1108.9212 1162.6836 1186.5190 1202.5276 1215.2629 1251.1153 1270.0211 1284.9573 1298.0052 1340.1537 1348.7854 1369.8122 1387.9752 1392.7841 1394.3375 1436.4722 1464.1914 1468.4200 1469.6870 1479.1143 1482.6314 1496.4732 1507.4268 1511.0269 1536.3881 1570.6842 1631.3267 1686.3114 2987.7831 2988.8080 3001.7726 3006.6970 3050.3477 3055.3959 3085.5567 3086.0187 3094.9975 3096.8548 3171.1967 3188.2314 3189.8694 3210.7580
redmass: 15.9717 4.3445 4.1005 3.1533 3.5155 4.4484 6.8334 4.7682 4.4244 2.2291 1.0912 2.3248 2.7435 4.8733 5.6292 7.6941 6.5638 3.8117 4.3362 4.2715 4.0419 3.9917 7.7577 7.8226 6.8930 3.1787 3.5147 4.7927 11.5232 6.7433 5.9464 8.8234 2.8817 5.1716 3.4618 6.6424 3.6043 1.1474 1.4552 1.5858 1.8303 1.7935 2.2148 5.6809 2.2233 1.3609 2.9614 10.1580 2.8890 9.1982 2.2074 1.8285 1.7264 3.7378 5.2438 2.0131 2.7600 2.5389 1.9310 1.5387 1.5145 1.2087 1.3790 1.2727 1.3307 3.3087 1.6543 1.2783 1.2305 3.9665 2.8049 1.1009 1.0668 1.1369 1.0600 1.1187 4.0207 1.3712 3.3133 8.6048 7.0778 9.9203 1.0357 1.0358 1.0606 1.0611 1.1027 1.1023 1.0998 1.0998 1.1015 1.1012 1.0886 1.0907 1.0922 1.0936
irintensity: 0.0015 0.1037 0.0129 0.1219 0.2862 2.6523 1.7661 2.0298 1.1794 1.7692 0.1551 1.8312 0.6774 0.8532 2.0388 0.5126 0.3024 0.4508 0.8994 2.1557 9.4672 2.2439 4.2625 9.6971 0.5270 5.6805 7.4516 2.6075 23.5755 1.3115 0.5080 3.0262 4.4459 4.0845 0.9705 0.0833 41.8749 4.9366 0.7897 22.2711 33.8460 24.1160 40.3258 56.9727 4.4281 2.9938 2.4683 232.4065 0.2126 265.3094 14.0559 27.0888 15.1140 102.9079 116.6752 24.5082 29.0149 123.2024 27.4172 114.3012 74.3071 3.8647 3.5956 12.8604 108.8756 3.3997 11.6701 8.2446 38.2878 186.6847 11.8556 10.3057 5.8261 0.6073 2.5206 32.9813 70.8258 27.3616 78.3041 61.6559 1127.9893 324.4378 26.5026 24.4077 44.4070 48.4970 3.9378 6.6627 32.3072 46.3697 16.1930 66.6338 9.2345 2.6496 6.3216 5.5213
temp: 298.150 k
press: 1.00000 atm
elementType: 9 9 9 8 8 7 6 6 6 6 6 6 6 6 6 6 6 6 6 6 1 1 1 1 1 1 1 1 1 1 1 1 1 1
symmnumber: 1
zpe: 669263.0 jmol-1
zpe.correction: 0.254909 hartree
zpe.thermalcorrener: 0.272996 hartree
zpe.thermalcorrenthalpy: 0.273941 hartree
zpe.thermalcorrgfe: 0.208534 hartree
zpe.sumelectzpe: -1045.147862 hartree
zpe.sumelectthermal: -1045.129775 hartree
zpe.sumelectthermalent: -1045.128831 hartree
zpe.sumelectthermalfe: -1045.194237 hartree
dipole: 9.0172 -3.5878 0.4137
dipole: 9.7135
quadrupole: -102.5048 -130.4815 -119.0206
quadrupole: 3.3783 -0.3573 1.5901
quadrupole: 14.8309 -13.1459 -1.6850 3.3783 -0.3573 1.5901
hfenergy: -1045.4027713 hartree
pointgroup: C01 [X(C14H14F3N1O2)]
dipole: 3.5867431 1.3173407 -0.0667394 debye
polarizability: 309.9516304|38.5864169|188.0772712|-1.7459014|0.3732751|94.5256675 unknown
InChI: InChI=1S/C14H14F3NO2/c1-3-18(4-2)9-5-6-10-11(14(15,16)17)8-13(19)20-12(10)7-9/h5-8H,3-4H2,1-2H3
charge 0 multiplicity 1
34 atoms
F  -2.633155 2.66763 -0.158125
F  -4.099204 1.316238 -1.214875
F  -4.09876 1.445112 1.0459
O  -0.783812 -2.173771 0.110906
O  -2.719165 -3.428949 0.175659
N  3.440518 0.135386 -0.011158
C  2.053398 0.181892 -0.01659
C  4.172667 -1.142436 0.150801
C  4.267372 1.354942 -0.163223
C  -0.855398 0.30326 -0.022552
C  -0.129469 -0.936762 0.046717
C  1.267825 -1.007748 0.045031
C  1.342115 1.435244 -0.081341
C  -0.050418 1.487081 -0.087164
C  -2.298903 0.208933 -0.018501
C  4.392683 -1.896065 -1.180639
C  4.544263 2.078012 1.174452
C  -2.946256 -1.018416 0.04762
C  -3.239976 1.396802 -0.085588
C  -2.234805 -2.282386 0.115866
H  3.636756 -1.783372 0.873902
H  5.150367 -0.908778 0.610998
H  3.785794 2.041524 -0.882191
H  5.224603 1.050567 -0.625302
H  1.712689 -2.003853 0.078308
H  1.892614 2.378324 -0.11326
H  -0.529875 2.464877 -0.134344
H  3.432571 -2.159706 -1.656388
H  4.958158 -2.829102 -1.003757
H  4.9665 -1.277024 -1.893495
H  3.60586 2.40696 1.653237
H  5.068873 1.410742 1.88161
H  5.179494 2.96705 1.007064
H  -4.036224 -1.08891 0.050323
