program: Gaussian 09
title: 000094494
version: EM64L-G09RevD.01
frameworkgroup: C1[X(C7H4ClNOS)]
method: RPBEPBE
basis: SDD
operation: Freq
keyword: #p
keyword: freq=noraman
keyword: PBEPBE/SDD
title: #p freq=noraman PBEPBE/SDD
converged: NO NO NO NO
title: Mulliken charges:
elementType: Cl S O N C C C C C C C H H H H
charge: -0.043419 0.220082 -0.154718 -0.411746 0.735388 -0.370482 -0.256686 -0.265371 -0.095088 -0.231568 -0.228728 0.351464 0.252649 0.258092 0.240130
chargesum: 0.00000
title: Mulliken charges with hydrogens summed into heavy atoms:
elementType: Cl S O N C C C C C C C
charge: -0.043419 0.220082 -0.154718 -0.060282 0.735388 -0.370482 -0.256686 -0.012722 -0.095088 0.026524 0.011402
polarizability: 1.49542614e+02 1.07276665e+01 1.34599441e+02 -4.26540800e-03 -8.68665332e-05 4.04225361e+01
1716.lowfreq: -1.8891 -0.0017 -0.0007 0.0009 1.6830 8.5070 101.1042 139.2808 160.0594
frequency: 101.1034 139.2742 160.0588 211.4020 302.7881 319.3039 360.2874 407.8177 476.5662 500.7517 505.8678 537.1010 570.3890 587.4898 654.2316 673.7842 726.0544 763.1642 766.5470 871.2107 889.5361 961.7086 1056.2910 1064.1062 1128.3988 1163.3875 1209.8615 1270.6062 1348.1939 1397.2048 1431.8054 1471.9005 1574.8868 1612.2707 1690.9226 3151.3126 3167.4751 3180.7772 3547.8698
redmass: 11.7094 8.2669 16.2123 4.7510 5.8223 10.5371 10.4261 14.6109 11.7518 5.4550 8.2897 4.0192 2.7329 6.8004 7.6146 1.5976 4.2036 8.7362 1.3891 5.1266 1.3496 1.3249 2.1268 5.4478 7.1638 1.2467 1.5779 1.9551 2.2163 3.7130 2.6312 3.9790 6.9513 8.3558 10.4031 1.0869 1.0929 1.0994 1.0784
irintensity: 0.0130 0.5736 1.2769 0.0245 11.6769 0.3407 7.4392 9.4807 2.9250 0.0757 2.4407 1.3605 17.1326 34.7630 3.0425 82.7962 49.0230 39.3709 58.5581 15.2741 0.0179 0.7772 19.4881 46.2698 83.9328 1.0139 1.4267 3.7378 43.7541 8.7427 33.4193 55.3271 18.7004 9.0201 702.7026 2.6054 2.4197 6.5726 65.5197
temp: 298.150 k
press: 1.00000 atm
elementType: 17 16 8 7 6 6 6 6 6 6 6 1 1 1 1
symmnumber: 1
zpe: 250938.9 jmol-1
zpe.correction: 0.095578 hartree
zpe.thermalcorrener: 0.104529 hartree
zpe.thermalcorrenthalpy: 0.105473 hartree
zpe.thermalcorrgfe: 0.060772 hartree
zpe.sumelectzpe: -1256.500227 hartree
zpe.sumelectthermal: -1256.491276 hartree
zpe.sumelectthermalent: -1256.490332 hartree
zpe.sumelectthermalfe: -1256.535033 hartree
dipole: 3.3501 2.1967 0.0000
dipole: 4.0061
quadrupole: -85.9554 -70.3489 -80.0369
quadrupole: -2.1352 0.0004 0.0001
quadrupole: -7.1750 8.4315 -1.2565 -2.1352 0.0004 0.0001
hfenergy: -1256.5958049 hartree
pointgroup: C01 [X(C7H4Cl1N1O1S1)]
dipole: 1.5528123 -0.2699785 0.0000192 debye
dipolederiv: -0.1457683 -0.0277263 -0.0000041 -0.1515335 -0.7287934 -0.000039 -0.0000111 -0.000034 -0.0453351 -0.4183338 0.160262 -0.0000198 0.3867323 -0.3990379 0.0000204 -0.0000382 0.0000334 0.0420573 -1.5513236 0.3772555 -0.0001063 0.4842887 -0.5677364 0.000036 0.0000595 -0.0000256 -0.3000571 -1.2687895 0.0371783 -0.0000227 -0.176028 -0.507978 -0.0000087 -0.0000782 -0.0000162 -0.2803927 0.4463449 -0.2907355 0.0000037 -0.6706647 -0.2330708 -0.0000461 0.0000438 -0.0000479 0.1185631 0.6163487 0.1126168 0.0000159 0.3821469 -0.0486927 0.0000225 0.0000509 0.0000214 -0.1073359 0.1747384 0.1463736 0.0000085 0.1854483 1.0957167 0.0000712 -0.0000029 0.0000751 -0.0831956 -0.1139759 -0.00915 -0.000001 -0.0868126 0.0744988 -0.0000009 -0.0000176 -0.0000015 -0.1058037 2.1271364 -0.4386294 0.0001489 -0.3873172 1.2289533 -0.0000377 0.0000045 0.0000228 0.1772728 -0.0920625 -0.0186457 0.0000014 0.0882281 -0.236464 -0.0000048 0.0000149 -0.0000076 -0.1055019 -0.0210694 0.0239566 -0.0000022 -0.0500132 0.0415808 0.0000033 -0.0000048 0.0000076 -0.1693116 0.1967797 -0.052064 -0.0000139 -0.0059208 0.2280219 -0.0000026 -0.0000107 -0.0000093 0.3521626 0.100475 -0.0439099 -0.0000007 -0.0060748 -0.0390436 -0.0000047 0.0000023 -0.0000075 0.1673349 -0.0042569 -0.0545432 -0.0000065 -0.0655168 0.0747749 -0.000006 -0.000013 -0.000011 0.1710657 -0.0462431 0.077761 -0.0000011 0.0730372 0.0172702 -0.000003 0.0000006 0.0000002 0.1684772 unknown
polarizability: 155.0051627|-1.9014672|129.1368921|0.0039494|0.0016136|40.4225361 unknown
InChI: InChI=1S/C7H4ClNOS/c8-4-2-1-3-5-6(4)9-7(10)11-5/h1-3,9H
charge 0 multiplicity 1
15 atoms
Cl 1.452931 2.742421 0.000216
S  -1.793712 -1.607568 -0.000017
O  -3.516523 0.610228 -0.000096
N  -1.177451 0.986957 0.000006
C  0.05954 0.330161 0.000064
C  -0.049071 -1.089047 0.00004
C  1.337323 0.921993 0.000116
C  1.096003 -1.905173 0.00005
C  -2.33862 0.206467 -0.000126
C  2.496076 0.125597 0.000105
C  2.368891 -1.285345 0.000071
H  -1.257958 2.006636 0.000025
H  1.007341 -2.995323 0.000028
H  3.481876 0.599208 0.000151
H  3.272454 -1.902713 0.000067
