program: Gaussian 09
title: 000094473
version: EM64L-G09RevD.01
frameworkgroup: C1[X(C9H8N4O2)]
method: RPBEPBE
basis: SDD
operation: Freq
keyword: #pfreq=noraman
keyword: PBEPBE/SDD
title: #p freq=noraman PBEPBE/SDD
converged: YES YES NO NO
title: Mulliken charges:
elementType: O O N N N N C C C C C C C C C H H H H H H H H
charge: -0.400980 -0.249199 -0.395925 -0.412270 -0.146701 -0.017674 0.164657 0.158861 0.172636 -0.354130 0.277682 -0.384863 -0.251977 -0.191197 -0.300466 0.256849 0.356146 0.225850 0.238999 0.236138 0.389151 0.265003 0.363408
chargesum: 0.00000
title: Mulliken charges with hydrogens summed into heavy atoms:
elementType: O O N N N N C C C C C C C C C
charge: -0.037572 -0.249199 -0.039779 -0.023119 -0.146701 -0.017674 0.164657 0.158861 0.172636 -0.097280 0.277682 -0.159012 -0.012979 0.044941 -0.035463
polarizability: 2.09450135e+02 1.21215326e+00 1.26720684e+02 1.57511526e+00 1.17824290e+00 6.65848893e+01
1716.lowfreq: -10.2438 -0.0006 -0.0005 -0.0003 1.7269 3.7196 38.9923 54.5371 76.3623
frequency: 38.8929 54.5296 76.3560 119.9843 153.0124 202.6091 204.9712 258.9713 336.4084 352.6691 357.7200 388.0880 435.0358 474.6299 524.8153 559.4704 633.5766 641.9048 658.4163 689.9804 715.5974 727.8091 757.5941 767.4508 805.5336 814.4449 847.0294 853.3837 868.0839 922.4452 945.6879 980.9016 999.9039 1031.5603 1041.3918 1063.1972 1107.8589 1156.5016 1172.7436 1176.7918 1221.1590 1231.7106 1245.3549 1255.9805 1293.8991 1324.7045 1390.1250 1393.2936 1429.7493 1474.0993 1493.9798 1569.1847 1582.2644 1607.1106 1612.4152 3119.9618 3131.3665 3150.4494 3173.5256 3259.9144 3547.2740 3558.3503 3576.8781
redmass: 6.2334 6.9732 5.5380 6.6566 6.2306 7.1398 6.3494 5.5585 6.1639 1.2404 5.2720 5.0983 4.4611 3.9365 4.7219 5.4675 2.4935 5.7225 1.5552 5.5450 6.5501 5.2799 1.8116 2.4784 1.1486 5.6830 1.2979 1.4958 7.4761 7.7053 1.3767 1.3312 3.6820 4.0667 2.4821 3.0390 2.0339 1.2465 2.2684 1.0582 3.5114 3.0047 1.5593 2.6423 1.4447 5.7902 5.3216 3.4866 2.3290 2.4816 2.6443 5.8444 6.6857 6.9123 6.8327 1.0889 1.0892 1.0926 1.1002 1.0990 1.0779 1.0845 1.0662
irintensity: 0.9885 0.2807 0.8620 6.2146 2.5628 5.8794 2.5752 6.3528 5.5209 119.6933 13.9883 5.8780 13.8958 7.2932 7.1647 1.9157 42.7783 23.4529 46.0473 4.5921 22.8736 6.0371 66.5521 20.2938 100.9481 23.1755 57.8548 1.4471 20.7878 20.5403 3.0613 0.1567 30.0103 56.6379 1.4248 54.9353 110.6921 36.6160 16.3889 4.2378 15.7568 111.6396 25.5115 28.0694 49.4562 87.0270 33.6695 42.9921 32.1818 72.9977 58.6902 481.9644 53.8917 31.1497 111.6648 11.7027 2.8079 13.8519 16.6175 2.5815 38.7293 108.6735 43.4291
temp: 298.150 k
press: 1.00000 atm
elementType: 8 8 7 7 7 7 6 6 6 6 6 6 6 6 6 1 1 1 1 1 1 1 1
symmnumber: 1
zpe: 439990.7 jmol-1
zpe.correction: 0.167584 hartree
zpe.thermalcorrener: 0.179848 hartree
zpe.thermalcorrenthalpy: 0.180792 hartree
zpe.thermalcorrgfe: 0.127885 hartree
zpe.sumelectzpe: -716.144051 hartree
zpe.sumelectthermal: -716.131786 hartree
zpe.sumelectthermalent: -716.130842 hartree
zpe.sumelectthermalfe: -716.183749 hartree
dipole: -6.4288 -1.1098 -1.1793
dipole: 6.6296
quadrupole: -78.5344 -81.8793 -89.9678
quadrupole: -4.7201 2.8968 -5.6366
quadrupole: 4.9261 1.5812 -6.5073 -4.7201 2.8968 -5.6366
hfenergy: -716.3116345 hartree
pointgroup: C01 [X(C9H8N4O2)]
dipole: -2.5099667 -0.6873417 -0.1753339 debye
dipolederiv: -0.0548989 -0.1265553 0.2300185 0.0068547 -0.7280114 0.4485442 0.0665714 0.4593847 -0.9404987 -0.7532409 -0.2119562 0.0340362 0.254051 -0.8971007 -0.0042378 0.0809781 0.0230944 -0.3112882 -1.6279807 0.2544539 -0.0050725 0.4707962 -0.506426 0.0138755 -0.0198433 0.0229584 -0.281946 -0.1297009 0.2035107 -0.01027 0.0638075 -0.4242351 0.0068181 -0.0006465 0.0096509 -0.1963178 -0.6954701 -0.0732189 -0.0052606 0.1796224 -0.4396007 0.0093981 -0.0234135 0.0089466 -0.2432284 -0.4561229 -0.1479855 0.0059249 -0.0030757 -0.2908686 0.0008028 -0.0123672 0.0055695 -0.1783587 -0.4458915 0.0060156 -0.1020995 -0.2397232 -0.1999 0.0556623 0.1998402 0.1069366 -0.1634047 0.1299918 0.1922745 -0.2250941 -0.1069466 0.5233477 -0.5835198 0.0024303 -0.5492603 0.8044321 1.9234239 -0.0688879 -0.0249801 -0.7543155 1.2190742 0.0294886 -0.0733048 -0.0581089 0.2081292 0.1235973 0.0266532 0.0591594 0.3353773 -0.0122995 -0.0827054 -0.0977582 -0.1072826 0.0164908 1.2155934 -0.0490247 0.0215706 0.036264 0.4317575 -0.0135787 -0.0321317 -0.0184278 0.1533947 -0.0512954 -0.2175741 0.3172782 0.0307055 -0.2344089 0.0579461 0.0257662 0.0096178 -0.197182 -0.3884752 0.0312968 -0.0711266 0.0232685 -0.0946246 -0.0935354 -0.1123196 -0.101341 -0.0837068 0.157788 0.0540447 0.0049638 -0.0927214 -0.0003252 -0.1519461 0.1756426 -0.128017 0.0754508 0.4077832 0.0560611 0.0103268 -0.1402423 0.3032358 -0.0223144 0.0247608 -0.0265506 -0.096318 0.0121682 0.0399347 -0.091551 0.0370746 0.1035403 0.0502219 -0.1013782 0.0463843 0.0598315 0.2127493 0.0032369 0.003885 -0.0571749 0.1900863 0.0085261 -0.0143356 0.0191403 0.3082748 0.0013494 0.0241926 -0.0719706 0.0506071 0.0972487 0.105766 -0.1069144 0.1057997 0.0163142 0.0581242 -0.0377575 0.0201484 -0.0628012 0.0620618 0.1235563 0.0318381 0.12745 0.0228815 -0.0953754 -0.0617021 0.0157822 -0.056896 0.1143255 0.0388765 0.0151506 0.0332444 0.1178403 0.3889278 0.0270107 -0.0074865 0.0014002 0.2966639 0.0071449 0.00799 0.0128181 0.3502027 -0.0009658 0.0364647 -0.0051082 0.0430383 0.0976475 0.0059214 -0.0030223 0.0064872 0.1799709 0.067921 0.0395122 -0.1030743 -0.0189705 0.3888114 -0.0107113 -0.0335331 -0.0084946 0.3790355 unknown
polarizability: 209.1908957|4.990284|107.7357287|3.7773528|-27.9188379|85.8290835 unknown
InChI: InChI=1S/C9H8N4O2/c14-7-4-2-1-3-6(7)8(15)12-9-10-5-11-13-9/h1-5,12-14H
charge 0 multiplicity 1
23 atoms
O  -2.005049 1.27768 -1.885105
O  0.377812 1.601426 -0.185984
N  0.984988 -0.637029 -0.026043
N  2.968826 0.817471 -0.089153
N  3.296072 -1.39769 0.05854
N  4.361525 0.669606 -0.05843
C  -1.391788 -0.090801 0.003223
C  -2.402952 0.415825 -0.862143
C  0.026696 0.385924 -0.092716
C  -1.764709 -1.012343 1.016605
C  2.362404 -0.414884 -0.018064
C  -3.74979 0.0080 -0.700681
C  -3.105057 -1.420297 1.18151
C  -4.097986 -0.902498 0.318468
C  4.491157 -0.684958 0.030022
H  -0.999397 -1.38121 1.709688
H  0.697438 -1.618293 -0.029019
H  -4.522085 0.398318 -1.375871
H  -3.372587 -2.121017 1.97795
H  -5.143462 -1.206403 0.436298
H  2.49818 1.721825 -0.164492
H  5.467378 -1.158925 0.075391
H  -2.781016 1.585575 -2.416896
