program: Gaussian 09
title: 000094524
version: EM64L-G09RevD.01
frameworkgroup: C1[X(C19H14Cl2)]
method: RPBEPBE
basis: SDD
operation: Freq
keyword: #p
keyword: freq=noraman
keyword: PBEPBE/SDD
title: #p freq=noraman PBEPBE/SDD
converged: YES YES NO NO
title: Mulliken charges:
elementType: Cl Cl C C C C C C C C C C C C C C C C C C C H H H H H H H H H H H H H H
charge: -0.051703 -0.021675 -0.486349 0.564465 0.463786 0.397595 -0.305695 -0.358355 -0.380065 -0.364715 -0.363113 -0.343477 -0.236411 -0.258946 -0.239393 -0.246911 -0.234806 -0.246689 -0.233164 -0.242819 -0.237590 0.266754 0.255793 0.262087 0.263340 0.272474 0.258743 0.235350 0.228074 0.228833 0.227317 0.230734 0.237014 0.228980 0.230539
chargesum: 0.00000
title: Mulliken charges with hydrogens summed into heavy atoms:
elementType: Cl Cl C C C C C C C C C C C C C C C C C C C
charge: -0.051703 -0.021675 -0.486349 0.564465 0.463786 0.397595 -0.305695 -0.091600 -0.124272 -0.102629 -0.099774 -0.071003 0.022332 -0.023596 -0.011319 -0.018078 -0.007490 -0.015955 0.003850 -0.013839 -0.007051
polarizability: 2.31808162e+02 -9.45156172e+00 2.39867055e+02 1.64693309e+00 6.20729199e+00 1.75867622e+02
1716.lowfreq: -11.0420 -5.4244 -2.4206 0.0023 0.0029 0.0029 28.1583 40.7992 55.5744
frequency: 28.0240 40.7023 55.5456 65.5518 72.0053 95.2586 137.4535 155.9850 179.6282 183.2732 247.4877 265.5675 271.1983 280.3986 299.8976 307.8911 366.4912 401.0672 404.6070 421.0091 451.4416 487.9350 508.8468 525.3397 613.3553 613.7084 619.7569 624.1138 647.0845 675.5693 701.3843 705.9710 721.8806 744.1491 764.8600 769.6105 797.9205 853.5145 857.5373 871.9045 890.9925 896.7522 938.5933 939.4500 957.2324 981.0175 984.0732 989.4314 989.8649 990.2853 996.9714 999.0897 1021.8726 1028.6482 1031.5214 1049.0184 1087.5919 1090.5798 1125.5867 1149.9793 1173.1077 1174.1029 1176.8711 1193.9740 1196.8228 1209.0504 1217.7862 1275.1129 1316.3821 1319.7788 1359.0569 1376.1475 1377.6667 1419.7809 1432.4804 1433.5298 1457.0236 1477.2309 1478.3481 1569.6402 1586.5701 1587.5943 1597.5519 1605.8658 1608.4715 3125.4006 3127.1722 3134.7117 3137.5892 3138.4436 3146.7611 3152.2993 3154.7187 3158.1409 3162.3045 3169.1378 3169.2236 3171.3649 3177.7592
redmass: 4.2877 5.4117 4.8385 5.4353 5.0637 4.7002 6.5769 10.9725 10.9132 8.2680 4.5583 5.5061 5.5801 5.6144 4.8707 9.4697 5.8769 2.8293 2.8775 9.1017 3.5797 3.9263 3.8381 4.0516 6.2493 6.1398 6.2245 5.9646 5.7841 5.8639 1.7302 1.7360 5.0128 2.2440 1.4130 1.9437 2.7108 1.2518 1.2553 1.5106 3.3757 4.0359 1.4949 1.7159 1.3931 1.3876 1.3793 4.1905 5.0250 1.5671 1.3282 1.3144 6.8324 2.4366 2.1632 2.2369 1.6077 1.6066 1.8814 2.4905 1.0523 1.0516 1.0797 1.1208 1.1261 3.8035 3.1805 1.4799 1.3566 1.3423 8.3382 7.5108 8.3134 2.1665 2.2414 2.2438 2.3647 2.1632 2.1921 5.9576 6.0299 6.0828 6.7118 6.0261 6.1011 1.0847 1.0849 1.0882 1.0888 1.0860 1.0930 1.0933 1.0912 1.0961 1.0957 1.0998 1.0943 1.0992 1.0993
irintensity: 0.1673 0.2988 0.1814 0.3205 0.3240 1.2067 0.2319 0.0568 1.8269 1.7710 0.5392 1.4811 0.1427 3.7474 0.1355 11.5387 0.6644 0.1234 0.7761 8.5957 1.6362 3.0474 1.7325 3.2883 3.6197 3.4349 15.6318 14.4286 28.5347 15.7723 51.4696 47.6445 18.9470 96.1929 50.7545 48.2147 1.7389 1.0828 0.5294 1.2536 9.4142 6.5681 0.1879 0.1442 0.2223 0.1764 0.2373 0.6350 2.1912 0.0597 0.0742 0.0255 41.0423 4.7568 17.0967 4.6145 3.3250 3.7426 2.2142 4.0037 0.0803 0.0701 3.0083 7.4582 7.8996 34.2525 19.9021 13.3361 4.1418 2.4631 6.4528 0.9722 0.7797 30.5044 19.3797 16.2075 24.2979 9.1420 15.5457 14.0028 0.9771 0.2062 7.6504 1.3162 1.3645 0.3939 0.0897 4.5583 10.2434 2.2815 26.3556 23.1400 11.3168 20.3930 16.8721 16.9216 3.8872 16.7756 15.7411
temp: 298.150 k
press: 1.00000 atm
elementType: 17 17 6 6 6 6 6 6 6 6 6 6 6 6 6 6 6 6 6 6 6 1 1 1 1 1 1 1 1 1 1 1 1 1 1
symmnumber: 1
zpe: 698131.4 jmol-1
zpe.correction: 0.265904 hartree
zpe.thermalcorrener: 0.283669 hartree
zpe.thermalcorrenthalpy: 0.284613 hartree
zpe.thermalcorrgfe: 0.218948 hartree
zpe.sumelectzpe: -1651.095187 hartree
zpe.sumelectthermal: -1651.077423 hartree
zpe.sumelectthermalent: -1651.076478 hartree
zpe.sumelectthermalfe: -1651.142143 hartree
dipole: 1.1958 -1.0348 -3.2418
dipole: 3.6069
quadrupole: -126.0230 -118.7070 -135.8490
quadrupole: 1.3495 3.3810 1.0407
quadrupole: 0.8367 8.1527 -8.9893 1.3495 3.3810 1.0407
hfenergy: -1651.3610912 hartree
pointgroup: C01[X(C19H14Cl2)]
dipole: -0.5856529 -0.1108624 1.2878052 debye
polarizability: 243.0536983|7.1242921|228.8140456|-3.63483|-4.5363255|175.6750955 unknown
InChI: InChI=1S/C19H14Cl2/c20-18-14-8-7-13-17(18)19(21,15-9-3-1-4-10-15)16-11-5-2-6-12-16/h1-14H
charge 0 multiplicity 1
35 atoms
Cl 0.022426 -0.086672 -2.581294
Cl 2.669475 -1.653131 -1.29961
C  -0.045372 0.024139 -0.596629
C  0.082993 -1.428354 -0.117329
C  1.10967 0.925128 -0.140347
C  -1.417729 0.657632 -0.299634
C  1.222565 -2.247928 -0.363435
C  -0.956735 -2.020266 0.652984
C  1.743428 0.679753 1.104615
C  -1.548721 1.674373 0.679856
C  1.47559 2.080471 -0.874674
C  -2.589082 0.205221 -0.966136
C  1.310888 -3.575659 0.098044
C  -0.881447 -3.344487 1.132913
C  2.735484 1.558719 1.593728
C  -2.814989 2.228458 0.981037
C  2.468834 2.956373 -0.388655
C  -3.85038 0.758325 -0.667483
C  0.253715 -4.132308 0.850206
C  3.105309 2.700098 0.848404
C  -3.970776 1.77552 0.309902
H  -1.840625 -1.42096 0.885136
H  1.468603 -0.201881 1.69376
H  -0.664337 2.03965 1.209494
H  0.99533 2.27496 -1.838265
H  -2.499413 -0.565413 -1.73807
H  2.204123 -4.164087 -0.130946
H  -1.707694 -3.753502 1.723459
H  3.219428 1.347439 2.553843
H  -2.891353 3.017306 1.737624
H  2.748638 3.8372 -0.977284
H  -4.738028 0.401868 -1.201837
H  0.325729 -5.164622 1.208273
H  3.880249 3.378143 1.223054
H  -4.950195 2.210691 0.537797
