program: Gaussian 09
title: 000094431
version: EM64L-G09RevD.01
frameworkgroup: C1[X(C7H3F7N2O)]
method: RPBEPBE
basis: SDD
operation: Freq
keyword: #p
keyword: freq=noraman
keyword: PBEPBE/SDD
title: #p freq=noraman PBEPBE/SDD
converged: NO YES NO NO
title: Mulliken charges:
elementType: F F F F F F F O N N C C C C C C C H H H
charge: -0.127931 -0.127932 -0.144387 -0.144661 -0.127163 -0.120018 -0.127265 -0.152711 -0.214439 -0.063722 0.128250 0.227270 0.314639 0.368176 -0.089106 -0.142998 -0.312802 0.291125 0.296487 0.269188
chargesum: 0.00000
title: Mulliken charges with hydrogens summed into heavy atoms:
elementType: F F F F F F F O N N C C C C C C C
charge: -0.127931 -0.127932 -0.144387 -0.144661 -0.127163 -0.120018 -0.127265 -0.152711 -0.214439 -0.063722 0.128250 0.227270 0.314639 0.368176 0.202018 0.153489 -0.043615
polarizability: 1.21926187e+02 -1.19020294e+01 9.57593222e+01 -9.39649460e-02 -2.34636859e-02 5.97472406e+01
1716.lowfreq: -15.7376 -5.3318 -3.5804 -0.0003 0.0009 0.0011 6.0642 33.9672 65.7755
frequency: -8.2438 33.9464 65.7719 75.9077 85.1901 158.4878 166.9593 182.3321 194.9383 212.7859 245.7917 261.0031 279.5467 297.2380 330.0056 330.2932 361.7903 441.3595 456.4980 501.6183 532.2056 553.1100 589.2937 629.8383 631.8120 647.4325 715.3359 728.9465 730.7967 810.3083 858.8481 871.7229 916.1075 974.8958 978.5531 1018.6976 1033.1934 1040.5680 1048.0461 1074.1815 1092.2895 1120.5134 1161.3894 1197.4275 1214.4036 1234.3325 1281.2894 1363.9584 1454.3520 1509.8577 1640.8341 3243.8752 3258.3911 3280.7108
redmass: 15.0355 13.0565 5.1720 10.8680 11.9106 7.3940 11.8888 11.2267 15.0781 18.6367 14.7704 18.2794 7.4029 18.0781 18.6461 17.4373 15.3767 17.0897 17.4287 12.4344 17.2666 12.1732 3.1848 14.1018 3.4994 16.3908 7.0477 11.9773 1.3103 1.4568 6.7522 1.4274 8.9695 3.9345 12.3548 9.9403 5.0911 12.8368 7.6142 13.3261 4.3794 1.6868 8.0639 3.5963 7.4542 1.6912 2.1417 4.6783 4.6155 4.7779 12.7703 1.0937 1.0991 1.1089
irintensity: 0.0943 0.0017 1.5235 0.6672 0.8861 5.2835 0.0891 0.4485 4.0707 0.1052 0.0045 6.5217 13.5942 0.6418 0.0540 1.5743 1.4060 1.0977 9.4066 5.5200 0.1102 16.1708 2.7549 51.3626 17.2679 44.1504 11.0013 139.6430 38.3468 46.5040 0.0309 3.4353 20.1747 119.0161 41.1532 48.6734 41.3515 13.2882 153.1044 400.4262 15.6213 71.5043 25.4087 5.4106 127.6976 33.4890 151.7762 98.4307 80.7293 12.8615 243.4194 4.5201 7.8430 2.6475
temp: 298.150 k
press: 1.00000 atm
elementType: 9 9 9 9 9 9 9 8 7 7 6 6 6 6 6 6 6 1 1 1
symmnumber: 1
zpe: 269871.4 jmol-1
zpe.correction: 0.102789 hartree
zpe.thermalcorrener: 0.117405 hartree
zpe.thermalcorrenthalpy: 0.118349 hartree
zpe.thermalcorrgfe: 0.060395 hartree
zpe.sumelectzpe: -1150.853988 hartree
zpe.sumelectthermal: -1150.839373 hartree
zpe.sumelectthermalent: -1150.838428 hartree
zpe.sumelectthermalfe: -1150.896382 hartree
dipole: 0.6187 -1.8756 0.0062
dipole: 1.9750
quadrupole: -106.2635 -94.1721 -96.8500
quadrupole: -3.8566 0.0265 -0.0122
quadrupole: -7.1683 4.9231 2.2452 -3.8566 0.0265 -0.0122
hfenergy: -1150.9567771 hartree
pointgroup: C01 [X(C7H3F7N2O1)]
dipole: 0.2444972 -0.7375499 0.0030896 debye
dipolederiv: -0.3529031 0.0259615 -0.0353609 0.0006396 -0.3419693 0.2315206 -0.0221836 0.1479427 -0.5352931 -0.3529472 0.0263446 0.0362964 0.0014512 -0.3430258 -0.2320588 0.0228711 -0.1484623 -0.5342558 -0.4203922 -0.0020896 0.0335472 -0.05488 -0.3701477 -0.2331513 -0.0428536 -0.1512819 -0.5158882 -0.4201233 -0.0025305 -0.0328595 -0.0552288 -0.3696009 0.233092 0.0431461 0.151054 -0.5170087 -0.3583773 -0.061432 0.0485969 -0.0349047 -0.4380968 0.2550678 -0.0278109 0.2129041 -0.5861722 -0.7826804 0.2577212 -0.0007931 0.1589228 -0.4405537 0.0004525 -0.0008383 0.000533 -0.2534306 -0.3584368 -0.0610139 -0.0476405 -0.0342536 -0.4393664 -0.255443 0.0284138 -0.2134691 -0.5850106 -0.639377 0.0468734 0.0004019 0.5870463 -0.8230792 -0.0015394 -0.0011028 0.0012824 -0.2369996 -1.6982306 0.5840552 0.0019588 0.2598137 -0.4070366 -0.0000032 0.0038449 -0.0009406 0.0051336 -0.5289624 0.1253944 0.0001068 0.4425233 -0.4151174 -0.0006351 -0.0010945 0.0003629 -0.2423592 0.7931771 0.0047091 -0.0005692 -0.0826893 0.6104453 0.0001094 -0.0009413 0.0001175 1.0927773 0.6869051 -0.0075107 -0.0008524 -0.1368165 0.6839568 0.0005862 -0.0006768 0.0006757 1.0430335 1.6319003 -0.4919593 -0.0011468 -0.630193 1.0847012 0.0019326 -0.0000899 -0.0002841 0.1489033 1.4989109 -0.1800781 -0.0001045 0.0470647 1.3204194 -0.0000649 0.000071 0.0000115 1.4175281 0.2168557 -0.1754845 -0.0001854 -0.454498 0.1485063 0.000509 -0.0002543 0.0000921 -0.1190451 0.9859823 -0.1469236 -0.0022061 0.2105349 -0.0039707 -0.0006343 -0.0024469 -0.0000055 -0.0470193 -0.187732 0.0041146 0.0001141 -0.2497264 0.3236469 -0.0005675 0.0011086 -0.0012269 -0.1319032 0.0962442 -0.0526797 0.0004932 -0.0198729 0.1111175 0.000214 0.0004041 0.0003346 0.2079775 0.1015781 0.0374416 0.0001428 0.0150564 0.0868357 0.000272 0.000065 0.0001421 0.1960104 0.0886086 0.0690863 0.0000603 0.0300108 0.0223354 0.0003414 0.0003683 0.000218 0.193022 unknown
polarizability: 121.9612339|-11.8634354|95.7241473|-0.0991542|-0.0550974|59.7473681 unknown
InChI: InChI=1S/C7H3F7N2O/c8-5(9,6(10,11)7(12,13)14)4(17)16-2-1-15-3-16/h1-3H
charge 0 multiplicity 1
20 atoms
F  -1.746931 1.343101 -1.152027
F  -1.750953 1.345915 1.149396
F  -0.194292 -1.029493 -1.142236
F  -0.197084 -1.027425 1.149253
F  -2.956109 -1.223203 1.136713
F  -4.074908 0.386429 -0.002715
F  -2.953065 -1.226171 -1.135467
O  0.806042 2.03113 0.000626
N  2.221542 0.169305 0.000648
N  4.496172 0.084611 -0.00507
C  -0.260969 -0.177967 0.002457
C  -1.656381 0.53078 -0.000099
C  0.96155 0.793436 0.00312
C  -2.922225 -0.407405 -0.000328
C  2.579769 -1.211876 0.002344
C  3.449871 0.901204 -0.004471
C  3.960033 -1.235997 -0.000543
H  1.843025 -2.007463 0.005922
H  3.462249 1.987552 -0.007131
H  4.617364 -2.101564 0.000007
