program: Gaussian 09
title: 000094440
version: EM64L-G09RevD.01
frameworkgroup: C1[X(C13H20N2O)]
method: RPBEPBE
basis: SDD
operation: Freq
keyword: #p
keyword: freq=noraman
keyword: PBEPBE/SDD
title: #p freq=noraman PBEPBE/SDD
converged: YES YES NO NO
title: Mulliken charges:
elementType: O N N C C C C C C C C C C C C C H H H H H H H H H H H H H H H H H H H H
charge: -0.317734 -0.500819 -0.165616 0.133525 0.523109 -0.701032 -0.701318 -0.747259 -0.392176 -0.419399 0.476989 -0.503838 -0.368431 0.298023 -0.631809 -0.670779 0.205316 0.212492 0.223848 0.212311 0.205360 0.223861 0.217900 0.214110 0.217479 0.224055 0.244220 0.208025 0.306462 0.319959 0.222902 0.222616 0.289792 0.234729 0.235480 0.247648
chargesum: 0.00000
title: Mulliken charges with hydrogens summed into heavy atoms:
elementType: O N N C C C C C C C C C C C C C
charge: -0.317734 -0.180860 -0.165616 0.133525 0.523109 -0.059376 -0.059786 -0.097770 -0.168121 -0.175180 0.476989 -0.295812 -0.061969 0.298023 0.103500 0.047078
polarizability: 2.52185523e+02 -1.62503397e+00 1.51003458e+02 -6.17208265e-02 2.48702604e-01 9.90394664e+01
1716.lowfreq: -16.7409 -5.4658 -3.3379 -0.0008 -0.0007 -0.0002 25.5581 33.9584 54.1848
frequency: 24.7776 33.9141 54.1067 79.1896 93.9274 102.0649 121.0066 164.9838 184.9301 193.8380 206.3674 217.6791 238.1755 258.2235 301.4325 307.6846 325.6118 351.7266 369.0118 381.9661 407.7958 434.0234 436.9718 456.0815 536.6147 545.7685 565.3886 599.7696 642.5047 684.8765 702.8682 740.7264 817.3220 823.8603 842.5586 858.5310 861.5690 916.4479 927.6483 935.3423 943.9166 986.9919 1000.8726 1008.8337 1019.6794 1024.0043 1059.4060 1095.2173 1111.6164 1126.9247 1135.0843 1162.9246 1198.3365 1206.1853 1216.5967 1253.2999 1268.1810 1272.8080 1311.0336 1339.1455 1367.5359 1372.9175 1374.3416 1402.1175 1413.0393 1416.9631 1447.6335 1458.6572 1462.8006 1465.3786 1476.7618 1479.8147 1480.6251 1486.3521 1493.1665 1493.7446 1496.3526 1500.6276 1516.9449 1589.5382 1621.2508 1629.5415 2935.7013 2962.4420 2969.8048 2971.1422 2976.7838 3002.5656 3035.4260 3063.7433 3065.3871 3069.6790 3073.9984 3076.8701 3079.0686 3094.3067 3096.5645 3115.2861 3132.3270 3151.7175 3193.4625 3548.8572
redmass: 2.9211 3.5852 2.9747 2.1339 4.0110 2.6719 2.0848 1.1777 1.1650 3.1177 4.1364 1.9691 1.0859 2.8419 2.9360 1.0455 3.0589 2.4379 3.0167 4.4242 2.9516 3.2077 3.0347 2.9793 3.2976 1.7418 1.5247 4.9173 6.8404 5.0460 11.2875 3.6446 1.4622 3.0783 4.1752 6.3633 1.4173 1.7436 1.6466 1.2943 1.2696 1.3229 2.9568 2.5263 1.4403 1.3846 1.4111 1.2315 2.2711 1.4544 1.3308 2.3252 1.1356 2.9763 2.6422 3.7470 2.2002 3.1178 1.5090 2.9441 3.8701 1.1889 1.2965 1.2041 3.6614 1.1565 1.1794 1.0513 1.0484 1.0676 1.1189 1.0946 1.0478 1.0508 1.1733 1.0499 1.2191 1.5541 2.5038 5.5203 4.1475 6.3921 1.0384 1.0366 1.0346 1.0348 1.0358 1.1016 1.1024 1.0998 1.0998 1.1009 1.0983 1.0993 1.0990 1.0882 1.0940 1.0961 1.0941 1.0893 1.0943 1.0752
irintensity: 1.4371 0.6070 1.8600 6.1741 2.9924 0.5457 1.1544 0.0098 0.2317 0.0664 0.8430 2.4200 0.1563 2.7528 0.7052 0.0316 6.2891 0.0087 0.0867 19.3284 0.3681 4.6255 1.7422 1.0329 3.2494 78.9668 7.9387 0.4999 1.7757 0.7492 19.7653 1.9345 36.2581 8.1363 0.2711 3.0977 39.4777 3.8049 2.4988 0.8284 0.0478 2.9394 42.9084 11.4008 5.5753 0.0755 20.1805 0.0201 33.8379 23.7358 0.2696 180.3966 36.6568 7.7741 0.7890 39.8945 11.5634 88.2221 17.9431 22.9966 230.5795 19.1816 31.7661 7.9079 33.8123 30.8060 28.4986 0.0246 0.6465 1.4572 29.5268 79.0572 30.1968 11.0455 45.4337 8.9999 227.7890 14.4752 492.4421 41.1339 158.4203 113.0445 55.7103 114.4883 34.5958 34.6612 35.5785 41.4444 46.3995 6.2202 7.0870 5.1547 144.0840 45.3771 48.1381 28.0688 16.0324 0.8683 27.7623 9.9727 6.0402 9.7171
temp: 298.150 k
press: 1.00000 atm
elementType: 8 7 7 6 6 6 6 6 6 6 6 6 6 6 6 6 1 1 1 1 1 1 1 1 1 1 1 1 1 1 1 1 1 1 1 1
symmnumber: 1
zpe: 804785.2 jmol-1
zpe.correction: 0.306527 hartree
zpe.thermalcorrener: 0.324365 hartree
zpe.thermalcorrenthalpy: 0.325310 hartree
zpe.thermalcorrgfe: 0.260286 hartree
zpe.sumelectzpe: -690.900620 hartree
zpe.sumelectthermal: -690.882781 hartree
zpe.sumelectthermalent: -690.881837 hartree
zpe.sumelectthermalfe: -690.946861 hartree
dipole: 1.9942 -4.0602 0.0275
dipole: 4.5235
quadrupole: -73.5674 -94.9029 -101.9354
quadrupole: -12.7118 0.1094 0.0937
quadrupole: 16.5678 -4.7677 -11.8001 -12.7118 0.1094 0.0937
hfenergy: -691.2071468 hartree
pointgroup: C01 [X(C13H20N2O1)]
dipole: 0.7571868 -1.6049968 -0.1340778 debye
polarizability: 252.0386289|-3.6253492|150.5346934|2.7712359|5.3318335|99.6551249 unknown
InChI: InChI=1S/C13H20N2O/c1-13(2,3)10-6-8-11(9-7-10)14-12(16)15(4)5/h6-9,14H,1-5H3
charge 0 multiplicity 1
36 atoms
O  2.815215 1.630886 0.339206
N  1.968252 -0.557338 0.101032
N  4.296541 -0.180023 0.204094
C  -3.833552 0.160733 0.068208
C  -2.292839 0.022386 0.08262
C  -4.439465 -0.653327 1.251555
C  -4.393316 -0.396792 -1.275759
C  -4.291628 1.635071 0.209063
C  -1.692236 -1.260299 -0.046222
C  -1.414314 1.125769 0.220142
C  0.567247 -0.304507 0.101067
C  -0.29621 -1.426363 -0.038014
C  -0.008836 0.983909 0.231215
C  3.008772 0.379375 0.222226
C  5.449976 0.726705 0.311799
C  4.553062 -1.621943 0.087335
H  -5.543222 -0.571219 1.248902
H  -4.179103 -1.725096 1.184233
H  -4.065065 -0.274681 2.220309
H  -4.125316 -1.459051 -1.420064
H  -5.497112 -0.319904 -1.292656
H  -3.991938 0.17261 -2.134079
H  -3.911881 2.261409 -0.6192
H  -5.396021 1.68494 0.188672
H  -3.953699 2.078361 1.163942
H  -2.322064 -2.151096 -0.156002
H  -1.820805 2.136577 0.322201
H  0.12966 -2.434166 -0.140369
H  0.646668 1.849857 0.337393
H  2.221683 -1.540251 -0.003341
H  6.095443 0.659124 -0.585433
H  6.057193 0.492489 1.20759
H  5.065619 1.754273 0.398897
H  4.192484 -2.040014 -0.875866
H  4.102254 -2.197956 0.921997
H  5.640156 -1.794552 0.126907
