program: Gaussian 09
title: 000094411
version: EM64L-G09RevD.01
frameworkgroup: C1[X(C10H14N2O)]
method: RPBEPBE
basis: SDD
operation: Freq
keyword: #p
keyword: freq=noraman
keyword: PBEPBE/SDD
title: #p freq=noraman PBEPBE/SDD
converged: YES YES NO NO
title: Mulliken charges:
elementType: O N N C C C C C C C C C C H H H H H H H H H H H H H H
charge: -0.358055 -0.399710 -0.685702 -0.018144 -0.710858 -0.671586 0.136622 0.221277 0.312168 -0.314036 -0.397193 -0.301840 -0.201579 0.246137 0.295397 0.233806 0.223494 0.199751 0.255260 0.208426 0.196829 0.189929 0.216224 0.225818 0.223721 0.293681 0.380163
chargesum: 0.00000
title: Mulliken charges with hydrogens summed into heavy atoms:
elementType: O N N C C C C C C C C C C
charge: -0.358055 -0.104313 -0.011858 0.227993 -0.053807 -0.011071 0.136622 0.221277 0.312168 -0.124107 -0.180969 -0.076023 0.022142
polarizability: 1.79976637e+02 8.64648515e-01 1.41758111e+02 -4.09307120e+00 -3.33588986e+00 7.03183206e+01
1716.lowfreq: -14.8947 -6.4509 -2.6894 -0.0003 0.0003 0.0003 20.6230 48.4585 69.2379
frequency: 17.0824 48.4335 69.2033 114.9198 147.2688 211.0041 238.3308 239.7846 246.5781 295.8221 375.0745 396.4195 408.7461 427.5620 452.5346 458.5028 492.8830 508.8644 532.0539 554.9299 655.1385 680.9303 743.1211 755.2833 785.3888 805.4193 840.9539 847.7489 859.7091 919.5698 923.2628 938.8901 954.0483 969.6856 1025.5677 1059.6348 1099.4454 1139.5368 1156.7439 1160.7664 1177.1028 1185.2916 1263.0624 1287.2288 1313.4408 1335.1499 1354.6423 1376.0306 1393.7106 1402.6074 1434.2372 1460.0843 1467.0547 1468.6470 1479.8011 1486.4949 1501.3496 1521.5638 1576.1725 1602.4794 1632.7244 2972.4155 2979.3794 3029.4267 3065.9856 3078.6063 3091.1152 3098.1765 3114.3393 3118.7391 3140.9338 3165.7307 3327.5984 3561.3051 3639.5211
redmass: 2.9462 4.6663 3.3588 3.8939 4.5823 1.0287 1.9200 4.0039 1.6109 2.8948 3.0854 3.1753 3.8174 2.3889 1.4007 2.7224 2.9516 1.4584 2.5713 6.2052 6.4203 4.0531 1.6488 1.8444 5.1390 1.3706 1.6286 3.0027 3.5069 1.2468 1.3930 1.5508 1.9428 1.3223 2.2653 1.8667 2.2384 2.1507 1.9219 1.4447 1.0963 2.2701 1.8518 1.7407 1.7401 1.8320 1.3242 1.2148 1.2432 5.5115 2.7563 1.2611 1.1431 1.2897 1.2578 1.0514 1.8238 3.9109 6.1708 1.5407 6.7521 1.0383 1.0364 1.0850 1.0976 1.0982 1.0999 1.0999 1.0861 1.0880 1.0936 1.0997 1.0600 1.0768 1.0910
irintensity: 0.2390 6.5378 0.1067 1.0364 0.2433 0.0184 3.7087 2.7079 0.1482 11.2409 2.8045 3.7075 4.9713 33.8069 107.3069 11.6644 12.5647 36.6456 66.8319 1.7290 13.1718 20.0110 49.5496 91.5694 3.8803 85.3313 3.1536 6.5519 0.5488 3.3221 1.0289 3.7362 10.8460 0.4633 8.3074 4.7800 3.4208 23.9606 10.0395 28.6656 2.4588 71.1664 93.4974 66.0522 47.3124 6.8320 19.7537 25.2146 36.6681 16.0854 32.3049 75.4230 34.1365 49.8378 2.2818 19.5760 272.0665 248.9634 61.3015 100.2080 187.0953 24.9227 35.0203 0.3609 9.8324 72.9989 32.9031 28.0949 20.6712 4.5425 33.9531 23.5914 178.5804 12.8685 51.9805
temp: 298.150 k
press: 1.00000 atm
elementType: 8 7 7 6 6 6 6 6 6 6 6 6 6 1 1 1 1 1 1 1 1 1 1 1 1 1 1
symmnumber: 1
zpe: 590111.8 jmol-1
zpe.correction: 0.224762 hartree
zpe.thermalcorrener: 0.237881 hartree
zpe.thermalcorrenthalpy: 0.238825 hartree
zpe.thermalcorrgfe: 0.184175 hartree
zpe.sumelectzpe: -573.251858 hartree
zpe.sumelectthermal: -573.238738 hartree
zpe.sumelectthermalent: -573.237794 hartree
zpe.sumelectthermalfe: -573.292444 hartree
dipole: 0.1920 -1.6024 0.6633
dipole: 1.7448
quadrupole: -64.4035 -71.6374 -83.1395
quadrupole: -7.6415 -0.2916 0.1287
quadrupole: 8.6566 1.4227 -10.0793 -7.6415 -0.2916 0.1287
hfenergy: -573.4766192 hartree
pointgroup: C01 [X(C10H14N2O1)]
dipole: 0.0133786 -0.4752591 0.4951734 debye
polarizability: 179.6228509|-5.1696054|128.1858007|-4.0124377|-28.3737313|84.2444168 unknown
InChI: InChI=1S/C10H14N2O/c1-7(2)12-10(13)8-5-3-4-6-9(8)11/h3-7,12H,11H2,1-2H3
charge 0 multiplicity 1
27 atoms
O  1.088587 1.437851 -0.956096
N  1.660357 -0.406663 0.309409
N  -1.398718 2.296469 -0.963872
C  3.110177 -0.210115 0.078516
C  3.828685 -1.572179 0.151637
C  3.698789 0.818028 1.074591
C  -0.731243 0.150717 0.044514
C  0.708009 0.436619 -0.234864
C  -1.737297 1.124126 -0.320455
C  -1.155613 -1.061025 0.660707
C  -3.106079 0.850887 0.003285
C  -2.503603 -1.322169 0.958686
C  -3.480357 -0.343938 0.631475
H  3.200522 0.208922 -0.9400
H  1.38122 -1.127061 0.975606
H  3.41722 -2.280695 -0.589141
H  4.906385 -1.445092 -0.052292
H  3.733495 -2.022758 1.159585
H  3.159079 1.776271 0.990784
H  4.767162 1.000145 0.855574
H  3.616407 0.452806 2.115682
H  -0.421198 -1.842378 0.89261
H  -3.866356 1.596243 -0.261263
H  -2.796448 -2.266914 1.426754
H  -4.536647 -0.526585 0.860378
H  -2.113926 2.978424 -1.202167
H  -0.407109 2.410566 -1.225542
