program: Gaussian 09
title: 000094457
version: EM64L-G09RevD.01
frameworkgroup: C1[X(C14H14N2O4S2)]
method: RPBEPBE
basis: SDD
operation: Freq
keyword: #p
keyword: freq=noraman
keyword: PBEPBE/SDD
title: #p freq=noraman PBEPBE/SDD
converged: YES YES NO NO
title: Mulliken charges:
elementType: S S O O O O N N C C C C C C C C C C C C C C H H H H H H H H H H H H H H
charge: 0.205360 0.262349 -0.148535 -0.423796 -0.265714 -0.211237 -0.174808 -0.369399 -0.478443 -0.176934 0.097088 0.189068 -0.794779 0.345610 0.238657 -0.771031 0.108481 -0.589532 -0.111947 -0.273909 -0.126479 -0.505071 0.325140 0.310839 0.358855 0.274514 0.283433 0.220240 0.247703 0.265402 0.261517 0.261340 0.388371 0.263090 0.247715 0.266843
chargesum: 0.00000
title: Mulliken charges with hydrogens summed into heavy atoms:
elementType: S S O O O O N N C C C C C C C C C C C C C C
charge: 0.205360 0.262349 -0.148535 -0.035426 -0.265714 -0.211237 -0.174808 -0.010543 -0.153303 0.133905 0.097088 0.189068 -0.236832 0.345610 0.238657 -0.037686 0.108481 -0.066676 -0.111947 -0.010819 0.121236 -0.238228
polarizability: 2.17669255e+02 -1.08619722e+01 2.03636834e+02 -2.29810744e+01 1.35209164e+01 1.99048652e+02
1716.lowfreq: -5.4912 -2.4768 -0.0013 0.0009 0.0011 5.1397 15.4930 23.3926 27.0935
frequency: 14.9649 23.3378 27.0823 45.7346 49.7691 59.0326 71.0082 73.0997 104.7582 113.0674 130.1076 144.6978 174.2699 199.7713 239.2869 248.1810 280.8205 282.2979 299.1969 324.9489 346.1154 374.3590 388.1185 430.1803 459.1123 478.7722 494.0851 536.8718 540.1229 549.9676 569.3316 590.6081 606.3806 621.3392 635.0087 647.1164 664.4149 683.7380 702.4647 705.6452 722.1973 726.8516 741.3540 787.3270 822.1750 837.9085 844.2599 875.9685 907.5521 916.8647 919.5089 939.0510 960.5027 993.7104 1023.7278 1027.2379 1040.1813 1080.0154 1095.7518 1104.8603 1127.0670 1155.5377 1167.3244 1180.1895 1198.0229 1200.1141 1221.4071 1226.2577 1243.0322 1247.9337 1260.9732 1290.0496 1301.0420 1328.3898 1343.0460 1380.2999 1400.9593 1419.1368 1436.3829 1460.5775 1461.6827 1476.3591 1483.7148 1550.2107 1620.3408 1625.5346 1646.9023 1737.8398 2974.4924 2995.0249 3006.4905 3044.2741 3048.7796 3061.2073 3069.5682 3079.3515 3134.4223 3163.0589 3185.7695 3239.5662 3505.8856 3511.4205
redmass: 6.1223 8.4273 6.2532 9.1084 6.9912 4.8139 6.0366 7.1699 1.6929 5.5461 3.0886 4.7239 3.5165 7.5273 5.2822 6.3845 3.0438 4.2846 4.0538 6.2281 3.4967 6.8875 6.5823 4.3734 5.8735 4.9472 5.7294 2.8921 4.0464 3.6142 3.6352 7.1999 4.6139 1.6328 1.2812 3.8142 4.6927 6.1129 1.2830 4.6460 4.9019 6.5797 5.5109 8.1189 3.9739 1.3944 1.7175 5.1494 1.5207 2.1806 3.1078 3.3696 4.1556 3.7757 1.4755 2.8803 1.6921 1.2313 3.1506 1.9142 1.6933 1.8271 2.8259 1.2165 1.7269 1.5488 1.5650 2.0376 1.2916 1.5561 1.5625 1.4568 2.2158 1.8588 2.2077 4.8054 1.2248 1.0963 1.0949 1.0751 1.0716 6.8506 1.9594 5.9151 7.9982 7.8241 8.1080 12.7952 1.0406 1.0605 1.0628 1.0971 1.0838 1.1004 1.0975 1.0898 1.0950 1.0917 1.0961 1.1004 1.0778 1.0639
irintensity: 0.8203 0.2457 0.3420 0.9291 2.6478 3.7489 0.8299 3.3991 1.0869 2.2624 0.7589 1.1285 1.9166 2.7798 5.6296 8.6066 2.9702 2.6703 4.6196 2.8674 3.6348 33.4698 1.9389 2.5513 9.9992 3.6585 17.3304 21.2000 13.7694 9.2179 7.4328 0.7583 1.3595 89.9808 55.0908 51.4514 7.5209 4.2048 110.6635 10.1619 2.6396 10.3299 22.7254 10.2049 10.0624 17.8974 1.7958 29.0183 0.4081 0.9022 12.4457 44.5623 36.3780 33.4641 12.1004 85.5686 10.8634 6.5388 174.4845 91.1293 5.6039 30.3280 10.5066 9.5475 4.2947 0.9210 9.0592 79.2384 17.4219 7.8074 6.3425 29.8627 186.9233 22.2500 0.1124 55.4029 22.0472 18.3843 50.7523 11.8925 16.1181 20.3038 353.4109 5.5706 310.0757 74.7854 170.3804 429.7110 19.7086 29.5057 8.0729 17.5797 29.1972 3.6182 1.4710 13.9546 5.5633 5.4033 3.2696 0.6083 60.8259 44.1143
temp: 298.150 k
press: 1.00000 atm
elementType: 16 16 8 8 8 8 7 7 6 6 6 6 6 6 6 6 6 6 6 6 6 6 1 1 1 1 1 1 1 1 1 1 1 1 1 1
symmnumber: 1
zpe: 684897.0 jmol-1
zpe.correction: 0.260863 hartree
zpe.thermalcorrener: 0.282482 hartree
zpe.thermalcorrenthalpy: 0.283426 hartree
zpe.thermalcorrgfe: 0.206391 hartree
zpe.sumelectzpe: -1746.783235 hartree
zpe.sumelectthermal: -1746.761617 hartree
zpe.sumelectthermalent: -1746.760672 hartree
zpe.sumelectthermalfe: -1746.837707 hartree
dipole: 2.8307 -4.0451 -5.1419
dipole: 7.1285
quadrupole: -121.6540 -143.7804 -147.4771
quadrupole: -7.0283 0.6718 -3.0105
quadrupole: 15.9832 -6.1433 -9.8399 -7.0283 0.6718 -3.0105
hfenergy: -1747.0440985 hartree
pointgroup: C01 [X(C14H14N2O4S2)]
dipole: -0.5919939 2.542502 1.0250876 debye
polarizability: 208.196136|-24.2795958|215.6472147|-2.7954315|15.2541829|196.5113904 unknown
InChI: InChI=1S/C14H14N2O4S2/c1-7-6-22-13-10(12(18)16(13)11(7)14(19)20)15-9(17)5-8-3-2-4-21-8/h2-4,10,13,15,19H,5-6H2,1H3
charge 0 multiplicity 1
36 atoms
S  -0.283958 1.05391 1.848539
S  4.354353 -0.571349 -2.044263
O  -0.845248 -0.991734 -2.113717
O  -4.394586 1.448133 -1.778869
O  2.053286 -3.135007 1.242789
O  -4.024545 -0.841133 -1.67539
N  -1.831058 -0.355618 0.033656
N  1.380736 -1.122409 0.280859
C  -0.998165 -0.588805 1.225561
C  -0.023254 -1.443637 0.325888
C  -0.908135 -0.956103 -0.87771
C  -2.864126 0.604286 -0.096766
C  -2.009253 1.839572 1.969262
C  -2.982645 1.632204 0.813874
C  2.342565 -2.013548 0.734321
C  -4.113137 2.641519 0.836191
C  -3.796072 0.30421 -1.227814
C  3.808889 -1.534365 0.621567
C  4.06987 -0.348982 -0.267317
C  4.121862 1.000949 0.063683
C  4.379143 1.875742 -1.056147
C  4.528961 1.200422 -2.255958
H  -1.510213 -1.098961 2.05463
H  -0.117559 -2.523128 0.538139
H  1.692107 -0.239721 -0.135465
H  -1.814235 2.920716 2.087346
H  -2.470527 1.487409 2.911656
H  -4.421649 2.844974 1.879783
H  -3.774514 3.60287 0.402595
H  -4.9884 2.316954 0.257933
H  4.393068 -2.419544 0.314594
H  4.136257 -1.298537 1.652428
H  -4.976592 1.157884 -2.533411
H  3.988573 1.359116 1.088611
H  4.452314 2.962383 -0.970745
H  4.726987 1.597527 -3.249833
