program: Gaussian 09
title: 000094401
version: EM64L-G09RevD.01
frameworkgroup: C1[X(C12H10O3)]
method: RPBEPBE
basis: SDD
operation: Freq
keyword: #pfreq=noraman
keyword: PBEPBE/SDD
title: #p freq=noraman PBEPBE/SDD
converged: YES YES NO NO
title: Mulliken charges:
elementType: O O O C C C C C C C C C C C C H H H H H H H H H H
charge: -0.401513 -0.159214 -0.137394 0.211997 0.326379 0.302253 0.034159 -0.543230 -0.145837 -0.207902 -0.372155 -0.372965 -0.666134 -0.220482 -0.231191 0.280728 0.181838 0.286650 0.291265 0.227103 0.252388 0.205085 0.239774 0.242465 0.375935
chargesum: 0.00000
title: Mulliken charges with hydrogens summed into heavy atoms:
elementType: O O O C C C C C C C C C C C C
charge: -0.025578 -0.159214 -0.137394 0.211997 0.326379 0.302253 0.034159 -0.080664 -0.145837 -0.207902 -0.085506 -0.081700 0.018442 0.019291 0.011274
polarizability: 2.04435669e+02 -1.62687835e+01 1.61773763e+02 6.24673378e+00 1.92474378e+00 6.53852464e+01
1716.lowfreq: -10.8407 -0.0003 0.0006 0.0008 5.9653 8.0140 40.7844 52.5574 69.6374
frequency: 40.6271 52.5551 69.6149 127.6942 155.6750 194.3764 196.9922 254.1499 323.9406 333.2760 352.4318 365.0139 397.9736 408.7808 420.7203 448.4826 480.0372 491.9747 566.7737 605.3734 646.9127 671.1156 677.9197 731.4207 755.4692 788.1109 847.7311 864.7117 876.5607 925.3739 948.3488 989.7817 1009.0854 1010.1946 1035.0052 1058.1014 1072.5499 1090.1778 1147.8422 1172.4001 1183.9200 1219.8715 1253.1861 1278.7508 1293.9333 1324.9589 1379.4283 1393.3922 1396.4503 1438.8528 1467.9126 1476.7773 1485.8732 1487.6633 1535.8340 1572.4056 1582.2152 1611.6321 1616.9213 2940.3379 2983.1304 3050.2742 3078.3653 3094.5540 3139.0129 3152.7952 3167.1078 3181.9993 3551.0062
redmass: 2.7586 9.8106 4.2951 4.4970 5.4545 1.3273 2.6748 4.0262 2.7016 5.9837 6.1353 7.4836 6.1442 4.6775 2.5300 3.2769 4.5810 2.0850 5.0028 5.7896 5.6979 4.3268 4.3769 3.9105 1.5893 1.4305 2.7083 3.1543 3.3305 1.7986 4.2888 1.3991 3.2104 1.3735 2.1653 2.2235 2.1093 1.9248 2.4835 1.1475 1.4097 2.5689 1.3725 1.6535 2.3134 1.9269 2.0478 2.1457 2.8798 2.4325 1.0634 1.2174 1.6347 1.3317 8.8915 8.9340 7.3346 8.3260 7.9919 1.0704 1.0363 1.0903 1.0991 1.1003 1.0864 1.0912 1.0972 1.0969 1.0650
irintensity: 0.4565 0.0423 1.6931 1.0971 0.5003 0.2788 1.5654 1.8925 0.6874 11.6730 4.9150 3.1001 2.4644 6.8818 53.3965 29.4011 11.9300 22.7399 3.6473 0.9829 6.4938 10.7239 22.6033 4.9315 0.7127 65.5172 1.4833 2.1727 42.6844 0.0257 9.7421 4.3831 34.9937 0.2462 3.6109 17.5779 5.4292 9.8274 62.9591 38.6694 91.0874 35.3642 27.4268 9.7149 49.7365 15.7019 45.3276 15.0471 11.8990 9.6378 15.1791 14.7574 4.6595 52.0990 273.8043 19.6394 70.6392 55.3705 6.0410 44.7318 34.4686 0.6788 42.9906 21.3356 3.5999 5.2771 16.5722 7.7538 45.0331
temp: 298.150 k
press: 1.00000 atm
elementType: 8 8 8 6 6 6 6 6 6 6 6 6 6 6 6 1 1 1 1 1 1 1 1 1 1
symmnumber: 1
zpe: 496114.3 jmol-1
zpe.correction: 0.188960 hartree
zpe.thermalcorrener: 0.202002 hartree
zpe.thermalcorrenthalpy: 0.202946 hartree
zpe.thermalcorrgfe: 0.148896 hartree
zpe.sumelectzpe: -687.879989 hartree
zpe.sumelectthermal: -687.866947 hartree
zpe.sumelectthermalent: -687.866003 hartree
zpe.sumelectthermalfe: -687.920053 hartree
dipole: 1.3681 -6.1692 -0.0269
dipole: 6.3191
quadrupole: -71.0708 -97.6729 -88.0687
quadrupole: 9.0496 1.3746 1.3192
quadrupole: 14.5333 -12.0687 -2.4646 9.0496 1.3746 1.3192
hfenergy: -688.0689487 hartree
pointgroup: C01 [X(C12H10O3)]
dipole: -0.649516 2.3995296 0.035737 debye
dipolederiv: -0.2905412 -0.2482056 -0.0023929 -0.0332288 -1.2985604 0.0510292 -0.0189717 0.0340416 -0.3725104 -0.7436504 0.3667415 0.0234491 0.2882634 -0.754703 -0.0255369 0.0213134 -0.013935 -0.300388 -0.4098292 -0.0990181 0.0072754 0.1271057 -0.8402903 -0.0068062 0.0046943 0.0225017 -0.2840647 -0.1294813 0.2122467 0.0124334 0.4643994 -0.8460364 -0.0006388 -0.0143739 -0.0001071 -0.1653448 0.0636317 -0.1944201 0.0050227 -0.1554022 0.0081832 0.0162634 -0.0078602 0.0253024 0.0220195 -0.4601142 0.2475575 0.0260182 0.1998053 -0.2494488 -0.0123462 0.0407353 -0.0090805 0.0275822 0.7083838 -0.016253 -0.0592583 -0.0113201 1.2737433 -0.0489642 -0.0348704 -0.0244774 0.0918312 0.0102985 0.0037047 0.0005298 -0.0399451 0.0678123 -0.0804503 -0.1263378 -0.0734061 0.103867 0.4072448 -0.2080641 -0.0167964 -0.5491984 1.1476595 0.0268724 0.0249712 -0.0143061 0.1680489 0.7007596 -0.1503896 -0.0336318 -0.3395663 0.938487 0.018919 -0.0327305 -0.0107204 0.1533438 -0.2932872 0.2149097 0.0044317 0.0382849 0.0406091 -0.0089578 0.0141807 -0.0238417 -0.1268298 -0.103069 -0.0707553 0.0043581 0.1468577 0.0938762 -0.0155685 -0.0030617 -0.0018871 -0.092136 -0.0017801 -0.022304 -0.0302607 -0.0420072 0.0479364 0.025358 0.0958614 0.0203703 0.0033058 0.2098936 -0.1796117 -0.0240283 -0.0665795 0.0203073 -0.0010376 -0.0275769 0.0103622 -0.1291975 0.1267177 0.0744611 -0.0294285 -0.0512848 -0.0892191 0.003225 -0.021305 -0.0081016 -0.1519662 0.0542814 0.0044312 0.0262264 0.1162166 0.0526676 -0.0899423 0.0103161 -0.0397741 0.0352275 -0.0032039 0.0161668 -0.0517966 -0.07116 -0.1065883 0.1617686 -0.0081121 0.0870436 -0.0280906 0.1245927 -0.0389938 0.0055024 -0.0214075 -0.0052689 0.0053955 0.0046321 0.007723 0.1593252 0.1050257 0.0104784 0.0039702 -0.0513363 0.0056006 0.0080311 0.0051113 0.0033136 0.1542971 -0.2121036 -0.0966469 -0.0071955 -0.1176924 0.072673 -0.0112795 -0.0197199 -0.0000894 0.0658771 0.1273306 -0.0243148 0.0008967 0.030993 -0.0433329 0.1119118 0.0075716 0.0568222 0.0129579 0.0280479 0.1168018 0.0692665 0.0669931 -0.028281 -0.1088959 0.0211445 -0.0533515 0.0022829 -0.0302211 0.0935414 0.0116865 0.1109659 0.0058389 -0.004922 0.0124421 -0.0036592 0.1546808 -0.0952918 -0.0433394 0.0218164 -0.0577058 0.0796909 0.0068334 0.0228741 0.0064098 0.1594155 0.1063648 0.0312756 0.0319055 0.0179494 0.4066438 -0.0202613 0.0290721 0.0028467 0.3364656 unknown
polarizability: 205.8856269|-14.1098611|160.41884|-5.9336263|-0.3341262|65.290211 unknown
InChI: InChI=1S/C12H10O3/c1-2-7-10(13)8-5-3-4-6-9(8)12(15)11(7)14/h3-6,13H,2H2,1H3
charge 0 multiplicity 1
25 atoms
O  0.713349 2.529573 -0.227071
O  2.358327 -2.011872 -0.229662
O  -0.286362 -2.928542 -0.00718
C  1.635157 0.275396 -0.266613
C  -0.846167 0.720581 -0.055914
C  -1.150173 -0.672454 0.006859
C  0.557527 1.14473 -0.189183
C  3.070815 0.757715 -0.379354
C  1.404127 -1.17373 -0.191267
C  -0.058264 -1.688773 -0.056859
C  -1.89666 1.667993 0.007818
C  -2.494441 -1.095693 0.131217
C  3.719045 1.040588 1.004453
C  -3.235066 1.233792 0.131166
C  -3.537661 -0.147776 0.192831
H  3.651359 -0.035341 -0.88211
H  3.148788 1.656438 -1.030026
H  -1.656029 2.732895 -0.040676
H  -2.694371 -2.171246 0.177138
H  4.762111 1.384566 0.884112
H  3.734023 0.117251 1.608446
H  3.166122 1.809644 1.575656
H  -4.042115 1.972568 0.179119
H  -4.576775 -0.479125 0.288138
H  1.668132 2.774421 -0.333136
