program: Gaussian 09
title: 000094374
version: EM64L-G09RevD.01
frameworkgroup: C1[X(C6H10O5S2)]
method: RPBEPBE
basis: SDD
operation: Freq
keyword: #p
keyword: freq=noraman
keyword: PBEPBE/SDD
title: #p freq=noraman PBEPBE/SDD
converged: YES YES NO NO
title: Mulliken charges:
elementType: S S O O O O O C C C C C C H H H H H H H H H H
charge: 0.926743 0.926730 -0.190464 -0.524965 -0.526303 -0.524987 -0.526223 -0.388495 -0.388531 -0.215843 -0.215827 -0.427927 -0.427924 0.245195 0.248504 0.248138 0.245539 0.246252 0.246269 0.244594 0.267462 0.244596 0.267469
chargesum: 0.00000
title: Mulliken charges with hydrogens summed into heavy atoms:
elementType: S S O O O O O C C C C C C
charge: 0.926743 0.926730 -0.190464 -0.524965 -0.526303 -0.524987 -0.526223 0.105204 0.105145 0.030409 0.030442 0.084129 0.084140
polarizability: 2.18571409e+02 5.37902119e-03 1.13549661e+02 2.25949209e-01 -1.46599882e-02 1.01357351e+02
1716.lowfreq: -118.3738 -117.6134 -39.3649 -26.6446 -0.0023 -0.0020 -0.0019 3.6112 4.5828
frequency: -118.3735 -117.6133 -39.3410 -26.6183 32.8694 43.7869 65.7494 94.3864 118.9097 192.3821 194.8305 198.9556 202.7733 219.2507 222.0424 248.5324 309.0358 324.6179 334.2627 417.8788 463.7888 522.4626 525.8266 546.2373 546.6819 556.6051 621.4270 806.7807 814.7022 850.3588 854.1146 894.6555 894.8901 922.6993 966.3917 969.7999 977.5374 977.7362 978.9432 980.5448 1084.0421 1165.5500 1187.8378 1206.3577 1211.2741 1239.3773 1256.3900 1394.9353 1395.0102 1399.6804 1439.2427 1612.1646 1612.3626 2963.8886 2972.8504 3064.8511 3066.8885 3097.5354 3097.5562 3152.7185 3152.7972 3207.2816 3207.3036
redmass: 2.0484 2.0145 4.2052 6.9631 6.3397 5.7713 3.4669 5.4555 6.5383 3.8823 4.1685 6.0035 6.4351 3.2640 3.3439 5.4969 5.9853 8.1396 8.6593 4.0368 3.9946 9.7543 11.2678 1.9375 1.9343 5.3103 4.3359 14.1895 12.6108 1.7626 1.8168 1.0973 1.0985 7.0952 3.4387 2.7902 1.2657 1.3748 1.5474 1.3030 8.4434 1.0670 1.1443 1.2656 1.2717 1.1917 1.2218 1.1715 1.1712 1.0635 1.1051 4.4462 4.4479 1.0482 1.0488 1.1143 1.1160 1.0585 1.0585 1.1015 1.1015 1.1150 1.1150
irintensity: 0.0465 0.0001 0.0071 3.2674 0.0356 1.0821 4.7665 4.2452 0.3327 0.0003 0.3513 48.9451 0.7421 0.0000 0.0057 0.2639 0.0092 0.1496 27.2812 9.4183 8.8042 3.7450 234.4541 0.1605 71.9406 4.0293 7.6224 2.1941 121.9443 21.3698 0.0090 0.0598 21.7828 2.5756 0.0585 18.2688 10.9784 0.7574 277.6048 1.1959 457.9843 0.0262 10.2385 33.6527 3.1835 2.2216 4.2543 28.2197 16.1484 11.0462 1.7724 6.1231 1.2892 85.4007 24.9491 27.9240 0.0320 0.2777 0.2512 3.1729 4.6314 0.8204 0.7953
temp: 298.150 k
press: 1.00000 atm
elementType: 16 16 8 8 8 8 8 6 6 6 6 6 6 1 1 1 1 1 1 1 1 1 1
symmnumber: 1
zpe: 401229.6 jmol-1
zpe.correction: 0.152820 hartree
zpe.thermalcorrener: 0.167122 hartree
zpe.thermalcorrenthalpy: 0.168066 hartree
zpe.thermalcorrgfe: 0.110208 hartree
zpe.sumelectzpe: -1405.383928 hartree
zpe.sumelectthermal: -1405.369626 hartree
zpe.sumelectthermalent: -1405.368682 hartree
zpe.sumelectthermalfe: -1405.426540 hartree
dipole: -0.0004 11.5334 -0.0039
dipole: 11.5334
quadrupole: -54.4929 -90.5408 -109.5881
quadrupole: 0.0006 1.0911 -0.0672
quadrupole: 30.3810 -5.6669 -24.7141 0.0006 1.0911 -0.0672
hfenergy: -1405.536748 hartree
pointgroup: C01 [X(C6H10O5S2)]
dipole: 0.0011729 4.534205 -0.1748064 debye
dipolederiv: 1.7176759 -0.0550436 -0.0015361 -0.0765358 1.2126599 -0.0007485 -0.0070616 0.0005549 1.2585613 1.7186242 0.0547611 -0.0047484 0.0760718 1.2128659 0.001389 -0.0076138 0.0027151 1.2585628 -1.9006398 0.0003846 -0.0061175 -0.0021578 -0.210163 -0.0043413 -0.0369638 -0.0017001 -0.3317013 -0.6397593 0.0227143 -0.0238174 0.0123861 -0.5084634 0.0083006 -0.0533022 0.1347571 -0.602705 -0.6380646 0.0207021 0.0222995 0.0129255 -0.5104347 -0.0079874 0.0552519 -0.1374065 -0.6051358 -0.6394429 -0.0228884 -0.0213977 -0.0161497 -0.5191356 -0.0133962 -0.0529499 -0.1409138 -0.591912 -0.6383787 -0.0202817 0.0246653 -0.008646 -0.5004346 0.0013354 0.0554503 0.1295779 -0.6151493 1.0270378 0.1447235 -0.0002028 0.7130012 0.0154184 0.0029538 -0.0035234 0.0062636 0.2359969 1.0256463 -0.1452422 0.0120174 -0.7111993 0.0164264 0.0126166 0.0644142 0.0083552 0.2355479 -0.0693834 0.1116983 -0.0027874 0.1206223 -0.0390192 -0.0018143 -0.0032889 -0.0019711 -0.3864877 -0.0693271 -0.111388 0.0086642 -0.120257 -0.0404963 -0.0236136 0.0087478 -0.0245765 -0.3848374 -0.2432272 -0.047405 -0.0000309 -0.2117574 0.0020024 -0.0000615 0.0015839 -0.0010506 -0.2264957 -0.2430058 0.0475105 -0.0029286 0.2114165 0.000712 -0.0156699 -0.0144467 -0.0156296 -0.2254018 -0.1120841 0.0269257 -0.0100899 -0.041516 -0.039344 0.0687715 0.0925035 0.0738887 -0.0465692 -0.1282755 0.0269592 0.0069683 -0.0334854 -0.0437783 -0.0692377 -0.091929 -0.0748536 -0.0405032 -0.1226097 -0.0272856 0.0102394 0.0270237 -0.0315301 0.0679903 -0.0941044 0.0734721 -0.0526298 -0.1179596 -0.0265234 -0.0069383 0.0485075 -0.0517444 -0.0688021 0.0893294 -0.0741703 -0.0344679 -0.0924755 -0.0078212 0.0021569 -0.0608951 -0.0618258 0.0016855 0.0022928 0.0014476 0.2041702 -0.0924251 0.0078074 -0.0010869 0.0607429 -0.0605984 0.0184501 -0.0047348 0.0182422 0.2029287 -0.0293843 -0.0977973 0.0020764 -0.0339531 0.0647992 0.0009942 0.002187 0.0014166 0.2080942 0.158353 -0.0050525 0.0001339 0.0193647 0.0129664 0.0006281 -0.0003946 0.000886 0.1667246 -0.0292451 0.0976228 -0.007081 0.0339193 0.0653964 0.0099705 -0.0027607 0.0101238 0.2074105 0.1583505 0.0049193 -0.0004584 -0.0194289 0.0137207 0.0105868 0.0013129 0.0105713 0.1659989 unknown
polarizability: 218.5709239|-0.041278|113.5324029|-0.3258462|-0.4587152|101.3750945 unknown
InChI: InChI=1S/C6H10O5S2/c1-3-12(7,8)5-11-6-13(9,10)4-2/h3-4H,1-2,5-6H2
charge 0 multiplicity 1
23 atoms
S  2.693392 -0.33888 -0.007219
S  -2.693393 -0.335853 0.041736
O  0.000231 0.179266 0.016359
O  2.706505 -1.134834 1.413848
O  2.681969 -1.143095 -1.42381
O  -2.691294 -1.231092 -1.319131
O  -2.69841 -1.037141 1.511903
C  1.194486 0.969088 -0.001237
C  -1.193414 0.968089 -0.042973
C  4.130532 0.922054 -0.023063
C  -4.129544 0.923126 -0.047991
C  5.397503 0.472589 -0.029665
C  -5.396904 0.475632 -0.019306
H  1.33307 1.548825 -0.934743
H  1.349469 1.562412 0.920887
H  -1.335347 1.489277 -1.009787
H  -1.343916 1.617287 0.84159
H  3.803351 1.968036 -0.025496
H  -3.801446 1.966347 -0.11984
H  6.240699 1.173577 -0.038989
H  5.63524 -0.597224 -0.025985
H  -6.239542 1.175558 -0.069487
H  -5.635536 -0.591444 0.054397
