program: Gaussian 09
title: 000094335
version: EM64L-G09RevD.01
frameworkgroup: C1[X(C6H14O2)]
method: RPBEPBE
basis: SDD
operation: Freq
keyword: #pfreq=noraman
keyword: PBEPBE/SDD
title: #p freq=noraman PBEPBE/SDD
converged: YES YES NO NO
title: Mulliken charges:
elementType: O O C C C C C C H H H H H H H H H H H H H H
charge: -0.474012 -0.479628 -0.398461 -0.341791 -0.019432 -0.354848 -0.374419 -0.696026 0.183916 0.203611 0.176415 0.234290 0.200203 0.197129 0.187104 0.196239 0.207705 0.214023 0.213038 0.208682 0.360275 0.355988
chargesum: 0.00000
title: Mulliken charges with hydrogens summed into heavy atoms:
elementType: O O C C C C C C
charge: -0.113738 -0.123640 -0.010933 0.068914 0.180771 0.029385 0.029525 -0.060284
polarizability: 9.23225544e+01 -6.12993232e-01 6.69489733e+01 -5.60981405e-01 4.11377607e-01 6.05864592e+01
1716.lowfreq: -10.6115 0.0008 0.0009 0.0010 4.8282 11.1031 53.9343 68.0023 93.2472
frequency: 53.8693 67.9983 93.2408 122.1558 137.9652 228.7687 232.6533 248.2760 291.3139 316.6969 422.9519 476.7222 492.4335 541.3640 729.6105 778.0694 837.8898 889.4957 909.4421 952.3510 999.9452 1020.2985 1028.5048 1061.6275 1081.4523 1111.0937 1125.1609 1188.6034 1197.0374 1216.5426 1250.3865 1262.8249 1284.9222 1290.3106 1315.9926 1342.8660 1356.7007 1381.1826 1389.1199 1405.3500 1445.6499 1459.0225 1468.0716 1476.7889 1477.3478 1487.9577 2939.9748 2954.1538 2959.6778 2965.1328 2970.7527 2972.4040 3006.2556 3016.7718 3027.1779 3053.3126 3069.4720 3071.2090 3515.4161 3596.0295
redmass: 3.1982 1.8754 3.5595 2.8400 2.2441 1.4227 2.0550 1.1297 3.4045 3.7645 2.7077 1.7614 1.3523 2.9227 1.0898 1.3524 2.3733 1.8737 1.2965 6.7071 1.5562 3.1426 2.0838 2.3689 2.3123 1.8925 1.5595 1.2965 1.4148 1.2613 1.1945 1.2626 1.1513 1.0771 1.3195 1.3081 1.5028 1.4207 1.2328 1.7182 1.0903 1.0815 1.0644 1.0475 1.0648 1.0825 1.0832 1.0550 1.0593 1.0607 1.0643 1.0363 1.0964 1.1046 1.1016 1.1019 1.1001 1.1000 1.0648 1.0669
irintensity: 1.6328 0.8042 2.9545 1.6289 6.6900 0.8938 2.4060 142.0938 9.0251 4.1906 6.7958 22.3714 135.3299 46.6342 7.1388 7.0406 12.0023 7.2814 4.7356 48.9677 16.2399 14.0560 63.2056 43.0978 4.0358 6.7908 1.4249 17.6704 6.0159 0.7781 26.4149 15.7015 8.6438 1.0307 15.3623 8.2348 1.5970 3.7134 12.2244 14.4317 3.2128 7.3592 0.2846 10.1284 5.3096 17.6801 31.5946 35.7428 11.2443 9.9260 108.5359 39.9058 17.3582 14.6403 55.6017 38.6806 87.0048 74.8103 14.9526 5.2818
temp: 298.150 k
press: 1.00000 atm
elementType: 8 8 6 6 6 6 6 6 1 1 1 1 1 1 1 1 1 1 1 1 1 1
symmnumber: 1
zpe: 508806.3 jmol-1
zpe.correction: 0.193794 hartree
zpe.thermalcorrener: 0.204458 hartree
zpe.thermalcorrenthalpy: 0.205402 hartree
zpe.thermalcorrgfe: 0.157463 hartree
zpe.sumelectzpe: -386.776569 hartree
zpe.sumelectthermal: -386.765905 hartree
zpe.sumelectthermalent: -386.764960 hartree
zpe.sumelectthermalfe: -386.812900 hartree
dipole: 1.6842 -2.4834 -0.1563
dipole: 3.0047
quadrupole: -41.8440 -51.4441 -51.9860
quadrupole: -3.9687 -3.0613 0.6601
quadrupole: 6.5807 -3.0194 -3.5613 -3.9687 -3.0613 0.6601
hfenergy: -386.9703627 hartree
pointgroup: C01 [X(C6H14O2)]
dipole: 0.6590131 0.9794102 0.0623208 debye
dipolederiv: -0.4005218 0.0052818 -0.1377343 0.0275934 -0.8081335 0.0709219 -0.1632144 0.0733713 -0.5206065 -0.8041573 0.2086659 0.143924 0.2438142 -0.4039253 0.124088 0.1826872 0.109491 -0.5041974 -0.1119809 0.0254296 -0.005541 -0.0187336 0.0987372 -0.0392324 0.0267695 -0.0624375 0.1322414 -0.0156565 -0.0084489 0.0162414 0.0385953 0.0523141 -0.0334983 0.031668 -0.0428205 0.1577067 0.2747729 -0.0569626 0.0671718 -0.1494899 0.5260437 -0.1229674 0.0441439 -0.09129 0.4253815 0.0322572 -0.0135001 -0.0017557 -0.051996 0.139396 -0.0412374 -0.0266063 -0.0405063 0.148674 0.5379658 -0.2458805 -0.1024734 -0.1536642 0.2380829 -0.0269014 -0.1073827 -0.0410652 0.3424763 -0.0701628 -0.0469752 -0.0245023 -0.018187 0.0580994 -0.0195311 -0.0037427 -0.0183471 0.0839269 0.0593338 0.0022711 0.0001168 -0.0148169 -0.1638426 0.0676162 0.0003885 0.0995742 0.0436595 0.0448093 0.0035185 -0.009896 -0.0157475 0.0723676 -0.0176191 -0.0071604 -0.0523619 -0.165937 0.0277836 -0.0035529 0.0016659 -0.0043217 0.0633963 -0.0103062 -0.0040754 -0.0342924 -0.2051121 0.0857534 -0.0061739 0.006744 -0.0063257 -0.1121317 0.0391929 0.0094498 0.0595855 0.0579053 0.0385226 0.0037242 -0.015028 0.0047335 -0.0257901 -0.0178663 -0.0108874 0.0233215 -0.2313871 0.0300319 -0.0087426 -0.0360977 -0.0022027 0.0658702 -0.0147876 -0.0017652 -0.0409233 -0.2060574 0.0225511 -0.0194025 0.0049395 0.0189735 -0.2048915 0.0532641 -0.0038572 0.0852888 0.0507063 0.0064222 0.0202177 0.0238275 0.0498595 -0.1740316 0.0878885 0.0176559 0.12783 0.0015802 -0.0078042 0.0381055 0.0211351 0.0525594 0.0316287 -0.0386572 0.0117771 -0.0959174 -0.185943 0.0828195 0.0273296 -0.0215246 -0.0375095 -0.1625917 0.0673032 -0.011485 0.0826455 0.0602771 -0.191083 0.0677778 0.0646474 0.0974255 0.0454206 -0.0443977 0.086723 -0.0424274 0.0627672 0.0796195 -0.0136428 0.0112521 -0.0239234 0.0799663 0.001558 -0.0545992 -0.01932 -0.1917826 0.1462274 0.1047304 0.0649321 0.0897604 0.3665557 0.0194344 0.0830414 0.0181065 0.3116719 0.1324962 -0.0837701 -0.0720445 -0.1263966 0.2174592 -0.104265 -0.0995284 -0.0975053 0.332049 unknown
polarizability: 92.313156|0.6997473|66.9549472|0.6829665|0.4047148|60.5898837 unknown
InChI: InChI=1S/C6H14O2/c1-2-3-4-6(8)5-7/h6-8H,2-5H2,1H3
charge 0 multiplicity 1
22 atoms
O  1.221652 -1.349859 0.433448
O  3.532059 -0.065844 -0.277826
C  -0.165898 0.626852 0.211022
C  -1.421446 -0.148534 -0.245555
C  1.138923 -0.043473 -0.239634
C  -2.736391 0.478111 0.269153
C  2.383762 0.781531 0.112172
C  -3.989144 -0.293541 -0.199699
H  -0.199199 1.662031 -0.188371
H  -0.157286 0.69831 1.317205
H  -1.445313 -0.189577 -1.354972
H  -1.337141 -1.19366 0.107383
H  1.124312 -0.19521 -1.342684
H  -2.714486 0.509658 1.377706
H  -2.801956 1.53252 -0.071209
H  2.38869 1.737816 -0.450317
H  2.401137 0.98617 1.203108
H  -3.958769 -1.342988 0.148826
H  -4.918037 0.165348 0.186602
H  -4.053882 -0.310081 -1.304195
H  2.14716 -1.680658 0.282596
H  4.377253 0.332677 0.043841
