program: Gaussian 09
title: 000094344
version: EM64L-G09RevD.01
frameworkgroup: C1[X(C12H18N6)]
method: RPBEPBE
basis: SDD
operation: Freq
keyword: #pfreq=noraman
keyword: PBEPBE/SDD
title: #p freq=noraman PBEPBE/SDD
converged: NO YES NO NO
title: Mulliken charges:
elementType: N N N N N N C C C C C C C C C C C C H H H H H H H H H H H H H H H H H H
charge: -0.087440 -0.089260 -0.087688 -0.061803 -0.063318 -0.060910 -0.043936 -0.043799 -0.044247 -0.452378 -0.453523 -0.452783 -0.046355 -0.051104 -0.049274 -0.704739 -0.705862 -0.705010 0.249598 0.251843 0.246677 0.233441 0.241344 0.232448 0.247012 0.233607 0.245292 0.226759 0.235791 0.211611 0.212252 0.225600 0.235173 0.226747 0.237283 0.210952
chargesum: 0.00000
title: Mulliken charges with hydrogens summed into heavy atoms:
elementType: N N N N N N C C C C C C C C C C C C
charge: -0.087440 -0.089260 -0.087688 -0.061803 -0.063318 -0.060910 0.205662 0.208045 0.202431 0.022407 0.025937 0.026115 -0.046355 -0.051104 -0.049274 -0.030579 -0.032837 -0.030029
polarizability: 2.39915071e+02 -2.60117050e-01 2.18590435e+02 -1.83216494e+00 -2.82538331e+00 1.06596692e+02
1716.lowfreq: -7.7683 0.0004 0.0005 0.0005 3.0633 6.4603 37.7192 46.6958 53.3753
frequency: 37.7008 46.6829 53.3601 67.6406 72.2342 78.6564 111.2038 125.6226 130.4592 190.2540 194.9659 203.3303 211.1754 212.3855 235.5746 258.2464 273.7077 325.4291 367.8548 383.2193 387.2679 423.6949 452.8672 502.0195 506.3766 509.0501 627.2671 696.5553 698.9591 743.6229 751.3827 786.4926 789.5704 802.9322 823.4917 869.7285 885.1838 887.7925 891.5094 895.6723 930.7021 949.9139 1015.2784 1016.4251 1020.3924 1022.9982 1066.5212 1081.0928 1083.4799 1084.5115 1085.1905 1104.4442 1105.0634 1108.5109 1136.6516 1143.9659 1148.4642 1152.6964 1158.0818 1163.6020 1226.1658 1228.5460 1232.8240 1234.5189 1356.8502 1364.5339 1377.0102 1391.7894 1395.1379 1398.2254 1430.5183 1433.5809 1457.8594 1458.3066 1461.8577 1464.0791 1464.5291 1473.4768 1476.5820 1477.2918 1477.5422 1479.2044 1479.5184 1549.1850 2988.8173 2988.9230 2989.1057 3074.2631 3075.8703 3076.3459 3080.5264 3080.6684 3081.9051 3084.3223 3084.5662 3085.0226 3103.2228 3103.3523 3104.3035 3180.6316 3182.4470 3183.3401
redmass: 3.2418 3.3200 3.3896 3.3227 2.8161 3.0067 3.9803 3.4305 3.4837 1.1845 1.2143 1.2953 2.9196 3.9403 3.2535 4.3535 3.4822 3.5781 2.9991 2.4340 2.2530 3.1699 3.5999 4.7866 4.3861 5.0056 5.7793 10.7256 10.7731 4.9263 4.6599 2.3235 7.0674 2.3869 2.1671 4.0358 1.6778 1.2845 1.4983 2.4504 3.2319 3.0504 1.2154 1.2374 1.7398 2.1410 1.9990 2.0042 1.4693 1.5244 1.4882 1.3888 1.4530 1.4857 1.5614 1.7938 1.9925 2.0062 2.1892 2.2162 2.2008 2.3587 4.3826 3.4436 1.8425 1.7236 1.4331 1.3047 1.3391 1.4419 3.0705 2.9107 2.3564 2.0163 1.0584 1.4711 1.6793 1.1511 1.0697 1.1091 1.0913 1.3623 1.3431 11.0718 1.0357 1.0356 1.0357 1.0555 1.0551 1.0570 1.0902 1.0883 1.0916 1.0984 1.0987 1.0985 1.0979 1.0978 1.0974 1.1176 1.1177 1.1177
irintensity: 2.5675 0.9671 1.9974 0.8683 6.5374 2.0926 6.4923 1.1334 2.6331 0.2320 0.6046 1.0629 3.5618 1.1143 4.4699 12.1822 18.3853 33.3550 0.1845 0.4264 2.1008 11.4577 18.7610 2.9648 8.3528 8.8171 0.8427 15.5487 1.8756 35.8462 3.4222 2.4214 11.1894 4.0603 0.7679 0.5310 5.3296 25.8441 15.3996 4.4482 21.4067 47.6480 9.6251 1.8615 21.6322 10.9457 3.7864 8.8835 2.4679 2.5631 0.8126 21.7822 14.9234 4.1903 1.5386 54.1165 40.0582 23.8901 9.0097 1.1390 31.5633 15.8196 5.4559 20.3106 1.5103 8.2642 2.7611 32.9302 11.6587 19.5777 19.8438 6.2128 1008.8638 1028.0386 65.4749 745.7841 862.5985 6.6770 4.6392 83.2945 52.1745 25.3645 11.4799 5.9871 17.2071 69.3571 5.6253 34.3843 16.5714 38.3309 3.2017 4.4023 1.5778 43.7404 22.8399 34.3488 25.9606 43.4411 32.4523 18.1915 17.1007 17.8768
temp: 298.150 k
press: 1.00000 atm
elementType: 7 7 7 7 7 7 6 6 6 6 6 6 6 6 6 6 6 6 1 1 1 1 1 1 1 1 1 1 1 1 1 1 1 1 1 1
symmnumber: 1
zpe: 768157.4 jmol-1
zpe.correction: 0.292576 hartree
zpe.thermalcorrener: 0.311097 hartree
zpe.thermalcorrenthalpy: 0.312041 hartree
zpe.thermalcorrgfe: 0.244876 hartree
zpe.sumelectzpe: -795.106396 hartree
zpe.sumelectthermal: -795.087875 hartree
zpe.sumelectthermalent: -795.086931 hartree
zpe.sumelectthermalfe: -795.154096 hartree
dipole: -0.2061 0.4004 1.4415
dipole: 1.5102
quadrupole: -89.9797 -93.2745 -107.2584
quadrupole: 0.7825 5.0817 4.2748
quadrupole: 6.8579 3.5630 -10.4209 0.7825 5.0817 4.2748
hfenergy: -795.3989721 hartree
pointgroup: C01 [X(C12H18N6)]
dipole: -0.1364198 0.0855646 -0.5719349 debye
polarizability: 218.6473929|-0.3836714|239.9334066|1.4708948|-0.5182734|106.5213988 unknown
InChI: InChI=1S/C12H18N6/c1-7-4-16(7)10-13-11(17-5-8(17)2)15-12(14-10)18-6-9(18)3/h7-9H,4-6H2,1-3H3
charge 0 multiplicity 1
36 atoms
N  -2.324131 0.301495 0.259265
N  2.154288 1.649077 -0.255079
N  1.112795 -2.911684 0.294146
N  -0.098668 1.025682 0.022254
N  -0.648218 -1.353212 0.148109
N  1.688261 -0.642076 0.038044
C  -3.127273 1.195926 -0.608711
C  2.302909 2.911775 0.508054
C  0.640633 -4.086801 -0.477789
C  -3.459949 -0.304356 -0.468338
C  3.419947 1.848021 0.485097
C  2.110596 -3.623352 -0.536776
C  -0.980273 -0.022526 0.119185
C  1.218767 0.645181 -0.035984
C  0.704052 -1.59236 0.13739
C  -3.95612 2.277636 0.055512
C  2.400438 4.208905 -0.270901
C  0.208832 -5.319398 0.292265
H  -2.638242 1.486929 -1.549263
H  1.715021 2.961687 1.435471
H  0.031642 -3.844901 -1.360432
H  -4.312434 -0.612105 0.146263
H  -3.219441 -0.972029 -1.304743
H  4.311018 2.017111 -0.128733
H  3.575252 1.234565 1.380762
H  2.873777 -4.185003 0.011966
H  2.462664 -3.111813 -1.440785
H  -4.393593 1.908748 0.999225
H  -3.326426 3.154151 0.289787
H  -4.775894 2.604018 -0.610242
H  2.883564 4.993221 0.33985
H  2.990303 4.066111 -1.192618
H  1.393922 4.560779 -0.558829
H  0.860475 -5.478719 1.168583
H  -0.828079 -5.203222 0.654083
H  0.256885 -6.216661 -0.351487
