program: Gaussian 09
title: 000094357
version: EM64L-G09RevD.01
frameworkgroup: C1[X(C21H18)]
method: RPBEPBE
basis: SDD
operation: Freq
keyword: #p
keyword: freq=noraman
keyword: PBEPBE/SDD
title: #p freq=noraman PBEPBE/SDD
converged: YES YES NO NO
title: Mulliken charges:
elementType: C C C C C C C C C C C C C C C C C C C C C H H H H H H H H H H H H H H H H H H
charge: 0.072902 -0.218041 0.248695 -0.554290 0.159310 -0.542776 0.245530 -0.594632 0.609880 -0.608480 0.135255 -0.715697 0.360871 0.324703 -0.490257 -0.442855 -0.367432 -0.436456 -0.819250 -0.263662 -0.243596 0.234703 0.232428 0.231005 0.232342 0.230585 0.229522 0.225319 0.226945 0.238765 0.238879 0.221954 0.229442 0.233753 0.227458 0.228767 0.227402 0.225307 0.225700
chargesum: 0.00000
title: Mulliken charges with hydrogens summed into heavy atoms:
elementType: C C C C C C C C C C C C C C C C C C C C C
charge: 0.072902 -0.218041 0.248695 -0.087159 0.159310 -0.079428 0.245530 -0.134525 0.609880 -0.156216 0.135255 -0.476932 0.360871 0.324703 -0.251377 -0.220901 -0.137990 -0.202703 -0.135623 -0.038354 -0.017896
polarizability: 3.92034943e+02 -6.03153479e+00 2.33499609e+02 2.13353579e+00 2.68607507e+00 1.08942472e+02
1716.lowfreq: -9.7855 -2.8916 0.0003 0.0005 0.0008 4.1910 44.6552 49.9877 64.6499
frequency: 44.6517 49.9428 64.6208 101.2282 111.2335 129.1314 172.0347 194.8091 221.6614 241.5177 251.0821 279.3185 318.2510 339.8508 366.8934 421.8608 437.4019 467.9987 481.6263 491.9564 508.7208 526.1446 547.6128 554.2440 595.0768 598.9472 617.3272 626.4810 656.8690 717.8811 733.4051 746.6307 758.4206 769.2679 773.8079 803.1290 811.5917 844.1187 872.6167 878.8226 899.7502 905.0730 943.1036 947.1118 959.5141 961.4251 983.9691 990.9266 997.2637 1018.5806 1031.9020 1040.0221 1044.4026 1051.6288 1095.3532 1118.0030 1139.9184 1160.1081 1174.6408 1176.0482 1183.5636 1202.6351 1202.9270 1217.0813 1230.5961 1240.1662 1245.3153 1272.0434 1284.8015 1304.2237 1313.7598 1334.7894 1348.2741 1370.6504 1379.8750 1395.4205 1417.5142 1439.0489 1448.3976 1454.5875 1459.7719 1462.3315 1465.3603 1468.1845 1469.0998 1482.0507 1493.3836 1497.8597 1580.3830 1599.8053 1610.1142 1620.6391 1633.8962 2955.4531 2964.4844 2966.9695 2977.3214 2991.2084 3017.4491 3034.4551 3038.6187 3039.1940 3041.8389 3080.4285 3112.2483 3115.5336 3126.3661 3134.5298 3138.8652 3143.3467 3160.4797
redmass: 2.2904 1.3081 3.6850 2.5257 2.4322 3.7289 3.1468 3.0079 3.0762 3.4295 3.5332 3.8791 3.1472 3.4660 4.6769 3.0579 4.1968 3.6879 3.4967 4.8787 3.6477 4.4035 2.8326 4.0244 3.8974 4.1444 5.6085 5.1758 3.6537 3.0912 3.3412 2.9322 1.9365 3.8219 1.6302 4.1353 1.3895 2.0899 1.3828 3.4089 2.6188 1.7805 2.8564 1.4158 2.3628 1.3862 1.3330 1.9366 1.9923 4.4633 2.6403 1.6327 2.1779 2.4234 2.1414 1.9910 1.1742 1.1854 1.2959 1.4902 1.7478 1.7650 1.1452 1.6436 1.5588 1.4064 2.4779 1.6867 1.6075 2.0689 1.9169 3.8445 1.7837 2.8677 6.3413 1.2591 3.0046 1.5979 2.2705 1.4752 1.1386 1.5976 1.5336 1.0641 1.2115 1.8708 3.5535 3.1657 6.4979 8.8488 6.4167 7.9466 8.6938 1.0678 1.0624 1.0377 1.0592 1.0621 1.1019 1.0943 1.0975 1.0984 1.1004 1.0980 1.0864 1.0866 1.0880 1.0910 1.0960 1.0927 1.1005
irintensity: 0.9631 0.0017 0.1163 0.0666 0.5335 0.1106 1.8740 1.0598 6.2086 0.1182 3.9303 0.3560 0.4065 0.1497 0.4500 1.3126 0.6235 3.7381 1.0113 0.3304 2.4898 0.9600 0.4172 4.3282 2.2223 4.6570 0.9206 1.2009 8.3584 13.0288 8.8458 5.9841 2.6700 4.3989 58.6932 2.8325 21.9927 0.5123 0.1554 4.2732 5.6762 30.3515 4.3810 1.2746 9.4280 2.7740 0.0284 1.2732 0.7074 1.0097 2.9264 4.6749 6.3419 2.8458 0.5960 5.3525 0.2694 2.0251 1.0794 0.7036 4.8902 0.8616 0.1701 0.7983 4.2885 0.1036 7.7485 4.3295 6.2166 3.0186 2.2947 6.2460 3.1011 1.0709 1.8797 5.2583 7.9998 2.6726 4.2530 7.3475 7.3371 4.5323 3.6512 14.1002 13.6678 4.9203 12.8031 40.5574 2.8736 15.4386 2.2856 6.9681 2.0959 25.8828 33.6189 58.2813 21.4266 52.5157 0.8314 46.4318 42.2827 39.1844 4.7795 21.5500 12.0106 11.0234 9.4356 12.0575 29.4711 31.8686 43.0640
temp: 298.150 k
press: 1.00000 atm
elementType: 6 6 6 6 6 6 6 6 6 6 6 6 6 6 6 6 6 6 6 6 6 1 1 1 1 1 1 1 1 1 1 1 1 1 1 1 1 1 1
symmnumber: 1
zpe: 842974.1 jmol-1
zpe.correction: 0.321072 hartree
zpe.thermalcorrener: 0.337467 hartree
zpe.thermalcorrenthalpy: 0.338411 hartree
zpe.thermalcorrgfe: 0.277239 hartree
zpe.sumelectzpe: -809.643692 hartree
zpe.sumelectthermal: -809.627297 hartree
zpe.sumelectthermalent: -809.626353 hartree
zpe.sumelectthermalfe: -809.687525 hartree
dipole: 0.8709 1.5550 -0.0483
dipole: 1.7829
quadrupole: -108.0140 -109.2733 -128.0393
quadrupole: 1.1011 -0.2198 1.0184
quadrupole: 7.0949 5.8355 -12.9304 1.1011 -0.2198 1.0184
hfenergy: -809.9647636 hartree
pointgroup: C01 [X(C21H18)]
dipole: -0.3414074 0.6124767 0.0188197 debye
polarizability: 392.0629373|5.7194005|233.4711304|1.7602526|-2.8209743|108.942957 unknown
InChI: InChI=1S/C21H18/c1-13-6-7-15-12-20-17-5-3-2-4-14(17)8-9-18(20)19-11-10-16(13)21(15)19/h2-7,12H,8-11H2,1H3
charge 0 multiplicity 1
39 atoms
C  -0.988994 1.226213 0.146596
C  -1.831074 0.083013 0.03697
C  0.397158 1.070776 0.141054
C  -1.871868 2.471218 0.254245
C  -3.21358 0.412966 0.052637
C  -3.353416 1.928303 0.197468
C  0.947239 -0.274599 0.026347
C  1.355242 2.246077 0.252885
C  -1.327839 -1.24608 -0.090843
C  2.604677 2.016423 -0.62776
C  2.430751 -0.429832 0.043469
C  0.095663 -1.392317 -0.095115
C  3.260677 0.688907 -0.281175
C  -4.170995 -0.605376 -0.059509
C  -2.315129 -2.281537 -0.206692
C  -3.679934 -1.955989 -0.188228
C  3.057352 -1.66208 0.378142
C  4.666792 0.544558 -0.281221
C  -5.661309 -0.316925 -0.04998
C  4.460202 -1.798196 0.368336
C  5.274465 -0.691293 0.032917
H  -1.685098 3.024453 1.194101
H  -1.674831 3.181883 -0.571665
H  -3.912161 2.368499 -0.651143
H  -3.914693 2.198624 1.11297
H  0.845294 3.183775 -0.03516
H  1.678756 2.368567 1.308325
H  3.326062 2.845064 -0.503873
H  2.295249 2.014608 -1.694068
H  0.522986 -2.392926 -0.224593
H  -2.003389 -3.327733 -0.309062
H  -4.420108 -2.761561 -0.276825
H  2.443253 -2.518948 0.675181
H  5.290463 1.412374 -0.529622
H  -5.949299 0.35352 -0.882909
H  -6.25284 -1.243613 -0.144671
H  -5.970684 0.186149 0.88665
H  4.917215 -2.758108 0.633695
H  6.365947 -0.786959 0.029725
