program: Gaussian 09
title: 000094297
version: EM64L-G09RevD.01
frameworkgroup: C1[X(C5H8O2)]
method: RPBEPBE
basis: SDD
operation: Freq
keyword: #p
keyword: freq=noraman
keyword: PBEPBE/SDD
title: #p freq=noraman PBEPBE/SDD
converged: YES YES NO NO
title: Mulliken charges:
elementType: O O C C C C C H H H H H H H H
charge: -0.233013 -0.260585 0.184794 -0.303287 -0.767235 -0.044984 -0.513299 0.245707 0.233216 0.232846 0.252369 0.259137 0.249745 0.231384 0.233205
chargesum: 0.00000
title: Mulliken charges with hydrogens summed into heavy atoms:
elementType: O O C C C C C
charge: -0.233013 -0.260585 0.184794 -0.057580 -0.048804 0.214153 0.201035
polarizability: 1.03581946e+02 -2.23945289e+00 5.79057414e+01 -4.27447332e-02 -2.21241253e-02 3.69487344e+01
1716.lowfreq: -4.7490 -2.8356 -0.0004 -0.0003 0.0002 13.3427 55.5622 73.3769 98.0007
frequency: 55.5324 73.3409 98.0003 125.0886 180.9391 237.9167 307.0043 349.1568 488.9845 571.3761 582.8827 849.7347 869.4790 942.2653 963.2169 965.4232 1022.4673 1106.7476 1110.8436 1156.1506 1220.8729 1294.9103 1322.4042 1365.8572 1433.8273 1442.8403 1456.0617 1463.3971 1467.8370 1567.2708 1653.4810 2979.6717 2979.8295 3063.3839 3077.8238 3090.2626 3124.0611 3138.9006 3151.5717
redmass: 1.6754 1.0557 1.5931 3.8535 2.4749 3.3537 3.1600 5.2606 3.1813 2.6199 4.4258 1.6305 6.2840 1.6521 1.1611 4.3905 1.7950 1.8680 1.2817 1.6696 2.1952 1.2537 2.5247 1.2944 1.1780 1.0961 1.0499 1.0508 1.0494 6.6453 5.5515 1.0320 1.0368 1.0967 1.1052 1.0925 1.0994 1.1015 1.0924
irintensity: 8.4186 0.1165 3.4176 9.0325 0.3951 8.5299 0.7342 2.0412 1.9645 0.0565 25.2184 16.7585 5.9088 37.3746 57.3828 67.6163 5.8845 135.3942 8.7340 132.0405 119.7253 17.4728 35.1091 60.1282 33.4572 28.0926 19.9105 30.0395 14.2243 269.9010 316.1285 57.1056 16.9896 16.9672 39.3526 3.5789 16.2758 16.4283 6.8896
temp: 298.150 k
press: 1.00000 atm
elementType: 8 8 6 6 6 6 6 1 1 1 1 1 1 1 1
symmnumber: 1
zpe: 313127.4 jmol-1
zpe.correction: 0.119264 hartree
zpe.thermalcorrener: 0.128020 hartree
zpe.thermalcorrenthalpy: 0.128964 hartree
zpe.thermalcorrgfe: 0.085084 hartree
zpe.sumelectzpe: -345.187584 hartree
zpe.sumelectthermal: -345.178828 hartree
zpe.sumelectthermalent: -345.177884 hartree
zpe.sumelectthermalfe: -345.221764 hartree
dipole: -2.9877 -1.3864 0.0217
dipole: 3.2938
quadrupole: -31.5290 -46.0121 -42.7003
quadrupole: -9.9436 -0.0397 -0.0154
quadrupole: 8.5514 -5.9316 -2.6198 -9.9436 -0.0397 -0.0154
hfenergy: -345.3068477 hartree
pointgroup: C01 [X(C5H8O2)]
dipole: 1.1973434 0.4800572 0.1232655 debye
dipolederiv: -1.9510998 0.180551 -0.0000609 -0.4487828 -0.2923481 -0.0093642 -0.1009694 0.0002331 -0.294039 -0.7030966 -0.0010726 -0.0068585 -0.4685975 -0.8911192 -0.1158308 -0.0975324 -0.1070345 -0.3593658 1.7844616 -0.0809121 0.0147219 0.4876299 0.9045345 0.1620654 0.1246593 0.1508287 0.1425124 -1.5381964 -0.0426626 -0.0316013 0.1866273 -0.0467593 0.0517577 0.0130527 0.0481879 -0.2869504 -0.3803045 0.2447838 0.0389404 0.3426162 -0.2083101 -0.0452999 0.0559327 -0.0459435 0.0553306 1.7814794 -0.0431218 0.0227097 0.2629344 0.1918609 0.0412404 0.070886 0.0356419 0.0283807 0.8718126 -0.170829 -0.0136417 -0.391737 0.3129371 -0.0096753 -0.0639406 -0.0045752 0.3216732 0.0780353 -0.0010615 -0.0021841 -0.0193722 -0.0618238 -0.0511365 -0.0059562 -0.0505295 0.1881219 0.0661626 -0.008821 0.0442558 -0.0065331 0.0001512 0.1121269 -0.0056414 0.1231645 0.0095253 0.0671017 0.0100919 -0.0416268 -0.0058108 0.0802804 -0.0853782 0.0068004 -0.0962878 -0.0724385 -0.069081 -0.0527602 -0.0122846 -0.1214073 0.0388725 -0.0170644 -0.0246671 -0.016556 0.1178645 0.0757276 0.0158395 0.0016044 -0.0055414 -0.038861 -0.043412 -0.0006816 -0.0438353 0.1748159 -0.0866573 -0.0630187 -0.0101675 -0.1066192 0.028699 -0.0124557 -0.0157986 -0.0131118 0.1222995 0.0035166 0.0105333 -0.0370363 0.1377741 0.0232631 -0.0928566 0.0639717 -0.1043918 -0.1056151 0.0001384 0.0024602 0.0332295 0.1568194 -0.0413771 0.1152831 -0.0201156 0.1242092 -0.0421151 unknown
polarizability: 103.28295|-4.3458778|57.4490958|0.4562546|3.8705546|37.7043764 unknown
InChI: InChI=1S/C5H8O2/c1-5(6)3-4-7-2/h3-4H,1-2H3
charge 0 multiplicity 1
15 atoms
O  2.109107 0.508765 -0.015273
O  -1.677374 -1.338144 -0.434019
C  -1.590153 -0.091993 -0.191181
C  -0.29164 0.602806 -0.034399
C  -2.838602 0.775162 -0.04532
C  0.87647 -0.097359 -0.151213
C  3.281835 -0.379325 -0.147961
H  -0.27553 1.677669 0.175607
H  -2.837668 1.584345 -0.800353
H  -2.861106 1.258597 0.949922
H  -3.741364 0.158465 -0.17246
H  0.852543 -1.178294 -0.36172
H  4.158632 0.276972 -0.055039
H  3.285483 -0.87664 -1.135347
H  3.288667 -1.135527 0.658256
