program: Gaussian 09
title: 000094292
version: EM64L-G09RevD.01
frameworkgroup: C1[X(C5H10O)]
method: RPBEPBE
basis: SDD
operation: Freq
keyword: #pfreq=noraman
keyword: PBEPBE/SDD
title: #p freq=noraman PBEPBE/SDD
converged: YES YES NO NO
title: Mulliken charges:
elementType: O C C C C C H H H H H H H H H H
charge: -0.429967 -0.215574 -0.311448 -0.690428 0.014598 -0.609995 0.203907 0.204427 0.189747 0.212924 0.232949 0.212644 0.221571 0.331713 0.217921 0.215012
chargesum: 0.00000
title: Mulliken charges with hydrogens summed into heavy atoms:
elementType: O C C C C C
charge: -0.098254 -0.011668 0.082726 -0.031911 0.236169 -0.177062
polarizability: 6.13174107e+01 -1.02998135e+01 5.93304487e+01 -3.92818270e+00 3.11836045e+00 5.08173735e+01
1716.lowfreq: -19.0392 -0.0007 -0.0004 0.0007 12.7305 21.8152 75.6860 90.2820 206.7116
frequency: 75.6504 90.1759 206.6957 210.5126 231.2865 294.1045 319.0234 443.6932 487.9649 679.8165 799.5927 897.0877 940.1829 943.6005 980.9726 992.6910 1003.7373 1066.0559 1093.2695 1167.0309 1212.6953 1271.1013 1283.5835 1316.0159 1325.5419 1370.6539 1386.7630 1430.7892 1470.0587 1475.5458 1481.2008 1657.3921 2945.5957 2961.5311 2975.4586 3056.3655 3067.1975 3075.2093 3088.4994 3090.1717 3193.1409 3561.5965
redmass: 2.2964 2.1593 1.7997 1.0410 1.8030 1.9815 1.9132 3.1749 2.5710 1.7050 2.0372 1.6976 1.4140 1.3933 1.3195 2.0283 1.3674 2.6734 1.6245 1.7175 1.7689 1.1996 1.2333 1.3347 1.3434 1.2059 1.1995 1.2042 1.0630 1.0577 1.0666 4.7522 1.0695 1.0818 1.0359 1.0958 1.0982 1.0751 1.0857 1.0928 1.1139 1.0661
irintensity: 1.5200 7.9175 48.7714 0.9914 102.8588 8.8624 9.6749 4.4059 6.7675 15.5365 1.2362 29.1321 33.0997 36.4416 33.1829 38.9560 58.3077 8.0015 7.3473 5.0002 6.3208 4.4685 1.0470 5.1010 2.0155 5.3241 29.4970 7.9325 4.4701 11.8659 7.1426 14.9069 77.4454 25.5331 39.0538 15.1270 41.6833 39.7637 23.4955 16.3099 28.6695 5.4388
temp: 298.150 k
press: 1.00000 atm
elementType: 8 6 6 6 6 6 1 1 1 1 1 1 1 1 1 1
symmnumber: 1
zpe: 362583.6 jmol-1
zpe.correction: 0.138101 hartree
zpe.thermalcorrener: 0.146040 hartree
zpe.thermalcorrenthalpy: 0.146984 hartree
zpe.thermalcorrgfe: 0.106126 hartree
zpe.sumelectzpe: -271.215012 hartree
zpe.sumelectthermal: -271.207073 hartree
zpe.sumelectthermalent: -271.206129 hartree
zpe.sumelectthermalfe: -271.246987 hartree
dipole: 0.8922 1.4725 -1.2767
dipole: 2.1434
quadrupole: -42.1824 -39.8399 -34.6542
quadrupole: -4.2980 2.0031 2.6927
quadrupole: -3.2902 -0.9478 4.2380 -4.2980 2.0031 2.6927
hfenergy: -271.3531132 hartree
pointgroup: C01 [X(C5H10O1)]
dipole: 0.3294533 0.5942263 -0.4994983 debye
dipolederiv: -0.6697511 -0.1255971 -0.1318575 -0.1449354 -0.7894501 -0.0325195 -0.1708018 -0.0651871 -0.1771589 -0.0189947 -0.0348102 -0.0084912 0.0476885 -0.0513224 0.0147875 0.0658907 0.0136178 0.127016 0.4326013 0.0924449 0.0547363 0.0644773 0.6488243 0.0475281 0.0209263 0.0859736 0.290871 -0.034761 -0.0098575 0.0069306 -0.0199116 -0.0153745 -0.0178203 -0.0346708 0.0463763 0.0966774 0.0707516 -0.2146422 -0.0189697 -0.2271354 -0.0586967 -0.0181587 0.0725303 -0.0728867 0.1598096 -0.2749811 -0.1074519 0.0379491 -0.1185319 -0.3381358 -0.0547313 0.0412067 -0.0614943 0.0852338 0.0216432 -0.0032884 0.022793 0.0136452 0.0259527 -0.0772223 -0.0147407 -0.0459004 -0.1821238 0.0730972 -0.0209209 -0.0113321 -0.0067036 0.0170108 -0.0424525 0.0461254 -0.069348 -0.1407175 -0.1216047 0.1084481 -0.0638216 0.0884871 -0.1283028 0.0583467 -0.1052303 0.1027089 -0.0026669 -0.0442087 0.1399381 -0.0907411 0.1212649 -0.0469589 0.0401748 -0.0911697 0.064063 0.039182 -0.097927 -0.1086746 0.0710599 -0.0705669 0.0369441 0.0074692 0.074714 0.0248279 0.0683413 0.0989314 0.0028076 0.0200346 -0.0170903 0.0639132 0.0001931 0.0079589 -0.081607 -0.1559352 0.0768134 0.0531242 0.0439892 0.0562027 0.1088266 -0.0105743 -0.0113118 0.0259438 -0.1302572 0.3604068 0.0405356 0.1459776 0.0227737 0.2772558 0.0074108 0.14626 -0.0296879 0.0260491 0.0133636 0.1412318 -0.0626758 0.1441745 0.1034925 0.0517247 -0.0715068 0.0618392 0.0269949 0.1146198 0.0467125 -0.0155814 0.0461611 0.1460212 0.0258442 0.0238196 0.0007608 -0.1313155 unknown
polarizability: 61.7384554|-10.1443445|58.726104|-4.2717691|3.2436095|51.0006734 unknown
InChI: InChI=1S/C5H10O/c1-3-5(2)4-6/h3,5-6H,1,4H2,2H3
charge 0 multiplicity 1
16 atoms
O  -1.78098 -1.318249 -0.016833
C  -0.055018 0.509489 -0.300559
C  -1.486786 0.11097 0.139676
C  0.160853 2.024598 -0.032811
C  0.998575 -0.321117 0.408874
C  1.997659 -1.005011 -0.201687
H  0.038382 0.332592 -1.393782
H  -1.620327 0.303752 1.219239
H  -2.224692 0.72818 -0.418762
H  -0.615178 2.63314 -0.535001
H  1.149041 2.348712 -0.401623
H  0.115567 2.242239 1.051122
H  0.924918 -0.339671 1.508166
H  -1.474715 -1.615029 -0.910896
H  2.739901 -1.572903 0.370153
H  2.102701 -1.01739 -1.294477
