program: Gaussian 09
title: 000094293
version: EM64L-G09RevD.01
frameworkgroup: C1[X(C7H13NO)]
method: RPBEPBE
basis: SDD
operation: Freq
keyword: #p
keyword: freq=noraman
keyword: PBEPBE/SDD
title: #p freq=noraman PBEPBE/SDD
converged: YES YES NO NO
title: Mulliken charges:
elementType: O N C C C C C C C H H H H H H H H H H H H H
charge: -0.383238 -0.050398 0.329977 -0.507678 -0.533626 0.351580 -0.706967 -0.721991 -0.796876 0.237415 0.228347 0.232510 0.229073 0.210311 0.219531 0.251672 0.254502 0.218569 0.204950 0.272665 0.230203 0.229469
chargesum: 0.00000
title: Mulliken charges with hydrogens summed into heavy atoms:
elementType: O N C C C C C C C
charge: -0.383238 -0.050398 0.329977 -0.041916 -0.072043 0.351580 -0.025453 -0.043970 -0.064539
polarizability: 1.00005813e+02 -7.97082815e+00 9.10386480e+01 -1.80220793e-01 7.71770019e-03 6.75529840e+01
1716.lowfreq: -17.2967 -13.7047 -0.0011 -0.0010 -0.0009 12.5786 67.7825 75.3359 136.8782
frequency: 67.5997 75.1370 136.8720 184.9718 223.5323 229.4440 269.3045 301.4384 313.8000 334.8611 385.9349 485.8490 550.9856 583.0160 635.5877 692.5241 772.9776 864.6368 893.8702 933.6332 953.9678 966.0803 994.7093 1006.4386 1021.5392 1040.4513 1115.7974 1136.3701 1192.1243 1217.2470 1231.7909 1250.3618 1278.5512 1310.4688 1355.4237 1370.7414 1387.3135 1397.9411 1450.2107 1453.4213 1464.5702 1467.7996 1468.3809 1474.4051 1477.6895 1490.2645 1576.2115 2953.1495 2963.6185 2983.4369 2989.0489 3011.2117 3024.2720 3032.8237 3079.5123 3082.5788 3087.5873 3093.3183 3095.1154 3101.5836
redmass: 1.1074 2.5058 2.1087 1.0599 3.0029 1.1277 2.2242 2.9854 2.6770 2.6427 2.3911 3.1906 3.7516 3.7506 6.0691 5.2883 1.5860 2.1600 2.2944 1.5979 1.5420 1.6125 2.2680 1.3938 1.6336 1.7097 1.3933 1.6163 2.2195 2.7237 2.0222 2.0317 1.8500 1.7290 2.6111 1.2219 1.2299 1.5641 1.0507 1.1050 1.0895 1.0538 1.0515 1.0642 1.0986 1.0562 5.3235 1.0653 1.0390 1.0349 1.0357 1.0774 1.0777 1.0967 1.1020 1.1024 1.0999 1.0976 1.1003 1.0993
irintensity: 0.2566 2.9813 0.2599 0.2220 1.1186 1.5339 3.3321 9.0365 4.6832 5.6646 2.2028 2.1058 4.4009 1.1509 0.3604 3.8783 2.2483 0.7291 1.2980 0.7561 0.5889 0.8960 2.8099 1.5258 5.9733 2.5739 2.7948 20.2967 46.8837 53.1061 2.1991 26.9608 7.6250 6.8467 7.9451 27.3500 34.8795 6.2935 2.2788 2.7641 8.4380 8.8250 13.6389 12.3470 9.0747 12.9360 44.1934 37.6936 50.0714 24.6568 16.5252 17.0108 42.0065 22.7566 7.3591 31.6390 43.4291 3.3107 15.0422 17.6703
temp: 298.150 k
press: 1.00000 atm
elementType: 8 7 6 6 6 6 6 6 6 1 1 1 1 1 1 1 1 1 1 1 1 1
symmnumber: 1
zpe: 496351.6 jmol-1
zpe.correction: 0.189050 hartree
zpe.thermalcorrener: 0.199277 hartree
zpe.thermalcorrenthalpy: 0.200221 hartree
zpe.thermalcorrgfe: 0.154045 hartree
zpe.sumelectzpe: -403.754740 hartree
zpe.sumelectthermal: -403.744514 hartree
zpe.sumelectthermalent: -403.743569 hartree
zpe.sumelectthermalfe: -403.789745 hartree
dipole: 0.1004 4.0275 0.0714
dipole: 4.0294
quadrupole: -50.1966 -61.9978 -54.5756
quadrupole: -1.1237 0.1327 -0.1116
quadrupole: 5.3933 -6.4078 1.0144 -1.1237 0.1327 -0.1116
hfenergy: -403.9437903 hartree
pointgroup: C01 [X(C7H13N1O1)]
dipole: -0.0532596 1.5842788 -0.0176884 debye
dipolederiv: -0.5163463 0.0635117 0.0055722 -0.3394452 -1.027753 0.0070075 -0.0157663 -0.0368103 -0.3214744 0.1059634 0.1540709 0.0114561 0.3629928 0.8373618 -0.0051311 0.0519245 0.0597261 -0.1165744 0.3510276 0.0950288 -0.0042364 0.0136242 0.0964004 -0.0129475 -0.0176114 -0.01801 0.3054887 -0.0770495 -0.0750824 0.0294642 -0.0683552 -0.0051536 -0.0213387 -0.0146188 -0.0086361 0.0982172 -0.0781803 0.0316664 0.0324787 0.0581708 0.0795912 -0.0140549 0.043188 0.0251601 0.208966 0.18556 -0.2469945 -0.0159733 -0.0349988 -0.0146846 0.0177948 -0.0419761 -0.068124 -0.1165003 -0.0337822 -0.0187722 -0.0356228 0.0363252 -0.0029695 -0.0213422 -0.0088901 -0.0324121 -0.0929261 -0.0342473 -0.0602471 0.0431472 -0.0133296 -0.0262194 0.042061 0.0440192 0.0368662 -0.0288261 -0.1309924 0.0765958 0.0061798 -0.0185708 -0.1281043 -0.012653 0.0190394 -0.0000954 0.1171302 0.0385342 0.0041762 0.0195537 0.0024429 0.0661638 -0.0239264 0.0479642 -0.0753032 -0.1449835 -0.0139267 0.1022883 -0.0420614 0.1030563 -0.0328499 0.0589794 -0.0614384 0.1003312 0.0328676 -0.0011705 -0.0820744 -0.0721786 -0.0801233 -0.0292904 -0.057984 -0.097646 -0.1273023 -0.0031689 0.0557094 0.0115521 0.0414232 -0.039531 -0.0455025 0.0647824 0.0739216 0.1452338 -0.1072085 -0.1297429 0.0846016 -0.0266876 0.1038785 0.0575851 0.0065581 -0.0162442 -0.0142943 0.0730052 0.0044885 -0.0723779 0.1132398 -0.0636274 0.0411129 0.090414 0.0686256 0.0590116 -0.0448105 0.121711 -0.0052077 -0.0047414 -0.0640077 -0.0805745 -0.0817539 -0.0020191 -0.0121018 0.0793709 0.1315937 -0.0047749 -0.0030985 -0.0896974 -0.0658023 -0.0150916 -0.0148774 -0.0591063 0.0870873 0.0529835 -0.0160355 -0.1002664 -0.0300593 0.0827782 -0.0314553 -0.0521284 -0.0077522 -0.1332858 -0.1201574 0.080364 0.0119733 0.1179394 0.0498719 0.0035656 -0.005826 0.02524 0.0826464 0.1294418 -0.0482984 0.0004739 0.0926212 -0.0481512 -0.0048718 0.0008257 -0.0019598 0.1208333 -0.0265905 -0.0375307 -0.0696664 -0.027068 0.1005533 -0.0826019 -0.1326364 -0.0649311 -0.0436115 -0.0148271 -0.0364601 0.0595708 -0.0222375 0.0956369 0.0939897 0.1321703 0.0752699 -0.0522427 unknown
polarizability: 99.8642773|8.0486621|91.1757957|-0.3630035|0.0818347|67.5573717 unknown
InChI: InChI=1S/C7H13NO/c1-6-4-5-7(2,3)8(6)9/h4-5H2,1-3H3
charge 0 multiplicity 1
22 atoms
O  0.249435 -1.972859 -0.024018
N  0.253769 -0.646933 0.020878
C  -1.091896 0.118509 0.008093
C  -0.638261 1.565802 0.346797
C  0.885904 1.623864 0.007957
C  1.312101 0.175147 0.015232
C  -1.675661 -0.025887 -1.415546
C  -2.020192 -0.516709 1.054966
C  2.709694 -0.352257 -0.043286
H  -0.788343 1.760579 1.423327
H  -1.219661 2.313824 -0.217621
H  1.451395 2.226127 0.743589
H  1.071833 2.086226 -0.984498
H  -2.67728 0.437325 -1.462922
H  -1.02955 0.461289 -2.168499
H  -1.765976 -1.095683 -1.672358
H  -2.158371 -1.587503 0.828027
H  -1.592602 -0.432775 2.070081
H  -3.003782 -0.013579 1.044304
H  2.684101 -1.455013 -0.061836
H  3.304815 -0.020856 0.829853
H  3.239627 0.008263 -0.947021
