program: Gaussian 09
title: 000094331
version: EM64L-G09RevD.01
frameworkgroup: C1[X(C11H15NO4)]
method: RPBEPBE
basis: SDD
operation: Freq
keyword: #p
keyword: freq=noraman
keyword: PBEPBE/SDD
title: #p freq=noraman PBEPBE/SDD
converged: YES YES NO NO
title: Mulliken charges:
elementType: O O O O N C C C C C C C C C C C H H H H H H H H H H H H H H H
charge: -0.432798 -0.243507 -0.244656 -0.407341 -0.605622 0.203793 -0.640446 0.538445 -0.720873 0.207287 -0.526349 -0.448317 0.212955 -0.368473 0.147645 -0.539163 0.192271 0.255150 0.237897 0.240551 0.208249 0.290236 0.277113 0.303132 0.227631 0.214698 0.376958 0.350865 0.223467 0.242367 0.226838
chargesum: 0.00000
title: Mulliken charges with hydrogens summed into heavy atoms:
elementType: O O O O N C C C C C C C C C C C
charge: -0.055840 -0.243507 -0.244656 -0.056476 -0.038274 0.203793 -0.193026 0.538445 -0.034176 0.207287 -0.223217 -0.220686 0.212955 -0.153776 0.147645 0.153510
polarizability: 1.72841658e+02 5.14299061e+00 1.54654658e+02 1.02479225e+01 -9.73604665e-01 9.38307635e+01
1716.lowfreq: -8.2206 -5.8626 -3.0110 -0.0001 0.0007 0.0008 26.1978 45.3310 65.8543
frequency: 26.1757 45.3264 65.8425 83.6857 104.5015 155.3186 162.9088 197.8004 225.3490 227.3129 236.2053 268.8750 278.3667 289.5460 312.0438 333.3317 342.2516 353.5997 362.1446 368.4852 453.8304 485.9520 513.8760 523.8594 535.7806 559.3866 574.5053 609.6877 633.5356 696.3587 717.8062 727.6092 740.1541 776.1278 794.2784 845.6855 894.0815 907.8463 913.3386 920.8357 962.6247 1000.5151 1023.7993 1058.1769 1081.2619 1094.9533 1111.7968 1148.5048 1154.9429 1164.3326 1179.1867 1233.2959 1241.5451 1262.4541 1274.0733 1303.0930 1314.0225 1339.2881 1378.2990 1405.7963 1413.9492 1445.0452 1456.3328 1460.4896 1466.6233 1471.6896 1476.5449 1512.6530 1601.7092 1614.6803 1616.9671 1662.0456 2961.8037 2981.4310 2983.7231 3049.2664 3057.9279 3080.6774 3098.2382 3106.7015 3126.2324 3137.3386 3170.2973 3457.8410 3515.1937 3572.0768 3594.6266
redmass: 4.0606 7.0786 4.1391 6.7511 3.4288 4.8800 4.5883 2.0399 2.1898 2.4735 1.3880 1.3690 1.4224 3.6902 3.7051 3.5761 1.6609 2.0019 3.0176 2.2912 3.3170 5.8439 2.6865 3.4873 3.6166 3.5095 1.7924 1.4431 3.8003 3.7892 5.2802 4.2988 4.5073 3.3980 1.7286 2.3726 1.4927 1.3565 1.9240 3.4281 1.9315 4.2393 2.3398 1.5702 2.2545 2.2960 1.2628 1.4469 1.9347 1.5362 1.5645 1.5601 2.0424 2.1044 3.2942 1.3597 2.1728 1.6798 1.2111 6.2952 2.2597 1.3642 1.0711 1.0779 1.0489 1.0707 1.0707 2.9899 5.9049 2.7136 1.5050 8.0418 1.0328 1.0476 1.0513 1.1037 1.0974 1.0992 1.1003 1.0877 1.0998 1.0956 1.0908 1.0439 1.0640 1.0659 1.0992
irintensity: 1.2546 0.4826 0.9399 4.3411 9.6445 0.5370 2.6774 0.3742 0.6760 21.6284 44.6797 0.1248 1.2117 12.5889 5.6144 1.0591 60.0928 53.9168 29.3039 3.7545 2.9060 5.1615 48.2751 6.7547 13.5600 15.3386 41.3392 285.7300 29.2771 1.0998 6.5566 27.6317 20.9774 32.8646 27.9943 5.0972 30.7980 8.8240 1.7495 1.2726 17.2161 37.3660 230.5422 47.5931 150.7519 113.0138 0.2869 2.4329 32.4376 12.7713 92.6788 19.6426 30.2619 62.6037 109.9433 28.1497 7.7673 10.3916 13.4133 9.2440 21.0125 13.1823 6.1313 9.4174 12.9190 51.0654 21.3709 127.4838 47.2956 6.8294 35.4689 210.1967 54.5307 25.2469 23.3958 45.6726 8.8995 24.2326 28.8693 19.9780 27.6614 16.7891 5.5044 1.4139 22.8412 34.4844 3.4718
temp: 298.150 k
press: 1.00000 atm
elementType: 8 8 8 8 7 6 6 6 6 6 6 6 6 6 6 6 1 1 1 1 1 1 1 1 1 1 1 1 1 1 1
symmnumber: 1
zpe: 646507.9 jmol-1
zpe.correction: 0.246242 hartree
zpe.thermalcorrener: 0.263096 hartree
zpe.thermalcorrenthalpy: 0.264041 hartree
zpe.thermalcorrgfe: 0.201938 hartree
zpe.sumelectzpe: -782.577200 hartree
zpe.sumelectthermal: -782.560346 hartree
zpe.sumelectthermalent: -782.559401 hartree
zpe.sumelectthermalfe: -782.621504 hartree
dipole: -2.4429 -2.0317 0.9994
dipole: 3.3308
quadrupole: -92.5438 -77.0116 -97.5737
quadrupole: -4.1791 -2.8859 1.8589
quadrupole: -3.5008 12.0314 -8.5307 -4.1791 -2.8859 1.8589
hfenergy: -782.8234419 hartree
pointgroup: C01 [X(C11H15N1O4)]
dipole: -0.9627396 0.7892923 -0.4091557 debye
polarizability: 174.0894728|-4.1365019|154.3238354|-5.7240889|1.6791676|92.9137712 unknown
InChI: InChI=1S/C11H15NO4/c1-11(12,10(14)15)6-7-3-4-8(13)9(5-7)16-2/h3-5,13-14H,6,12H2,1-2H3
charge 0 multiplicity 1
31 atoms
O  -3.395091 -1.339603 -1.400883
O  2.954924 -1.467424 0.069707
O  -1.865207 -2.005891 0.200466
O  4.118653 0.914325 -0.340675
N  -3.853914 0.638418 0.560037
C  -2.494149 0.425744 -0.007056
C  -1.46818 0.726425 1.13384
C  0.000769 0.79244 0.735819
C  -2.21523 1.274752 -1.277222
C  -2.495478 -1.079516 -0.351684
C  0.770249 -0.393799 0.592574
C  0.634992 2.03734 0.52259
C  2.134452 -0.345672 0.232633
C  2.002071 2.098491 0.163238
C  2.758939 0.919204 0.012032
C  2.339477 -2.777929 0.297621
H  -1.760042 1.709348 1.555675
H  -1.627798 -0.028044 1.924899
H  -2.985306 1.081892 -2.043207
H  -1.223821 1.05357 -1.710421
H  -2.236968 2.34728 -1.00848
H  -4.609743 0.531045 -0.123442
H  -3.937992 1.484014 1.131887
H  0.276424 -1.353957 0.763165
H  0.067697 2.967672 0.641568
H  2.484507 3.07238 0.00466
H  -3.435718 -2.321777 -1.557339
H  4.438696 1.843045 -0.46344
H  1.978234 -2.877652 1.339645
H  3.143185 -3.504746 0.109571
H  1.497569 -2.956576 -0.399081
