program: Gaussian 09
title: 000011046
version: EM64L-G09RevD.01
frameworkgroup: C1[X(C5H10ClN)]
method: RPBEPBE
basis: SDD
operation: Freq
keyword: #p
keyword: freq=noraman
keyword: PBEPBE/SDD
title: #p freq=noraman PBEPBE/SDD
converged: NO YES NO NO
title: Mulliken charges:
elementType: Cl N C C C C C H H H H H H H H H H
charge: -0.075602 -0.090068 -0.413137 -0.417316 -0.390604 -0.318725 -0.583282 0.212304 0.242797 0.243312 0.214435 0.165232 0.228419 0.242369 0.225184 0.259179 0.255503
chargesum: 0.00000
title: Mulliken charges with hydrogens summed into heavy atoms:
elementType: Cl N C C C C C
charge: -0.075602 -0.090068 0.041964 0.040432 0.003046 0.148828 -0.068599
polarizability: 9.19156772e+01 5.12775161e+00 6.26220611e+01 -1.40149627e+00 -6.06672673e-01 5.17925957e+01
1716.lowfreq: -26.7880 -3.0771 0.0032 0.0035 0.0039 7.2616 56.7149 75.1074 108.4105
frequency: 56.6461 75.0910 108.4065 145.7098 254.1996 290.3660 371.2114 454.0036 655.3657 729.4502 775.0604 795.5216 820.3162 859.1948 968.5350 988.9272 1045.8637 1051.1751 1066.0605 1071.2559 1080.5523 1110.8006 1140.2482 1181.2928 1245.4085 1258.4458 1266.1484 1284.9553 1319.6399 1369.3934 1452.5923 1458.5689 1465.1332 1476.3800 1485.2570 2860.4717 3012.4460 3019.6540 3047.1513 3051.7835 3062.5000 3078.0760 3129.3799 3166.0803 3183.2919
redmass: 4.0897 2.1220 3.7632 2.5110 4.9323 3.2566 2.4708 3.2540 5.8865 3.0768 1.0924 1.7409 2.4660 1.2429 1.2055 2.0274 1.5111 2.0258 1.3810 2.4984 1.4015 1.6010 1.4524 1.5143 1.3020 1.9953 1.4759 1.1292 1.2851 1.3863 1.0877 1.0992 1.1006 1.1351 1.1000 1.0698 1.0712 1.0778 1.0564 1.0514 1.0622 1.1032 1.1112 1.1136 1.1148
irintensity: 1.3617 0.5203 0.7757 2.2327 3.4083 2.0435 5.1581 12.1640 19.6984 40.1706 9.3454 1.8040 6.8748 0.2958 2.4598 15.9274 3.6777 7.1283 3.1942 6.1160 13.1675 3.1843 0.4089 2.4016 6.4617 11.3938 5.0754 7.8409 20.6783 25.4707 4.3225 3.1271 1.3346 2.0411 12.9594 89.9207 4.6292 27.7785 31.0773 33.4785 32.9699 13.6209 28.2038 1.5927 41.0693
temp: 298.150 k
press: 1.00000 atm
elementType: 17 7 6 6 6 6 6 1 1 1 1 1 1 1 1 1 1
symmnumber: 1
zpe: 375555.7 jmol-1
zpe.correction: 0.143042 hartree
zpe.thermalcorrener: 0.151281 hartree
zpe.thermalcorrenthalpy: 0.152225 hartree
zpe.thermalcorrgfe: 0.108919 hartree
zpe.sumelectzpe: -710.706409 hartree
zpe.sumelectthermal: -710.698169 hartree
zpe.sumelectthermalent: -710.697225 hartree
zpe.sumelectthermalfe: -710.740531 hartree
dipole: -2.5036 -1.3241 1.8316
dipole: 3.3729
quadrupole: -56.9210 -48.0611 -51.5701
quadrupole: -2.0516 -2.1433 -0.0270
quadrupole: -4.7370 4.1230 0.6140 -2.0516 -2.1433 -0.0270
hfenergy: -710.8494504 hartree
pointgroup: C01 [X(C5H10Cl1N1)]
dipole: -0.9529599 0.561117 -0.7334374 debye
dipolederiv: -0.6351132 0.1276802 -0.0172062 0.2292261 -0.2752818 0.0171671 -0.0469909 0.0240159 -0.1945707 -0.7188379 -0.1646213 -0.0792047 -0.1545698 -0.1266182 0.0094395 -0.152257 0.0096321 -0.3687421 0.1228561 0.0263699 -0.0531982 0.0589305 -0.0129021 -0.0148728 -0.0151155 -0.0347756 0.2120339 0.120035 0.0850787 -0.0093579 0.0845237 0.0366707 -0.0858154 0.0017959 -0.0793043 0.1679806 0.4530546 0.1276022 -0.0280431 0.0054671 0.2401471 0.0108335 -0.0059701 -0.0467736 0.3337172 -0.2170634 0.0258429 0.0031275 0.105715 -0.0148364 0.0251502 0.0236524 0.0787569 0.0619214 0.7157581 -0.2297148 0.0564662 -0.2066309 0.3368263 -0.0216016 0.0325722 -0.0219977 0.2297472 0.0293129 0.0100293 0.0411577 0.0464129 -0.0001068 0.1149156 -0.0520655 0.140606 -0.0609427 -0.0939419 0.0614437 0.0785684 0.0660837 0.074187 0.0064873 0.1039654 -0.0081828 0.021767 0.0725297 -0.0569058 0.0366721 -0.0980762 -0.0862109 0.0317246 0.0438232 0.058851 0.0450229 0.0672079 -0.0090916 0.101331 -0.0201805 0.0298539 -0.020198 0.0510404 -0.0895257 -0.119573 -0.0517 -0.0125282 -0.0372167 -0.018164 0.03228 0.0240364 0.0689133 0.1106476 -0.2666031 0.0092827 -0.0507632 -0.0106771 -0.0600969 -0.1439042 -0.0603258 -0.0006024 -0.0763223 0.0507024 0.0819494 0.0024829 -0.0062951 -0.0174919 0.0797819 0.0284151 -0.0219562 0.0268467 -0.1002015 0.0661691 -0.0403037 -0.0088624 -0.0463571 -0.0948949 -0.0592084 -0.003335 -0.0739769 0.0505509 -0.0129926 0.0349386 -0.0184536 -0.015572 -0.1207269 -0.0409554 -0.0305814 -0.0696521 0.0599623 -0.0085063 0.0624601 -0.0488078 0.0407802 0.0457354 0.0348081 0.0031111 0.0511549 -0.122773 unknown
polarizability: 90.9308271|-7.3981532|63.5495997|1.0006849|-1.2023899|51.8499072 unknown
InChI: InChI=1S/C5H10ClN/c6-2-1-3-7-4-5-7/h1-5H2
charge 0 multiplicity 1
17 atoms
Cl 3.690366 -0.682125 -0.04514
N  -1.505632 0.105694 0.547243
C  -2.836714 0.480923 -0.056237
C  -2.25354 -0.905965 -0.287461
C  -0.306907 0.711725 -0.095076
C  0.926412 -0.173925 0.193493
C  2.197133 0.4347 -0.396972
H  -2.842778 1.167219 -0.915071
H  -3.652389 0.626069 0.658125
H  -2.645727 -1.768535 0.259444
H  -1.876669 -1.126551 -1.296718
H  -0.429315 0.844938 -1.200469
H  -0.166253 1.716047 0.349423
H  1.033155 -0.28786 1.286741
H  0.763852 -1.183529 -0.227328
H  2.455294 1.404548 0.055704
H  2.163412 0.521628 -1.494401
