program: Gaussian 09
title: 000094230
version: EM64L-G09RevD.01
frameworkgroup: C1[X(C13H15N3O2)]
method: RPBEPBE
basis: SDD
operation: Freq
keyword: #p
keyword: freq=noraman
keyword: PBEPBE/SDD
title: #p freq=noraman PBEPBE/SDD
converged: YES YES NO NO
title: Mulliken charges:
elementType: O O N N N C C C C C C C C C C C C C H H H H H H H H H H H H H H H
charge: -0.267507 -0.302252 -0.413577 -0.389566 -0.609812 -0.604592 0.419439 -0.145847 0.091959 0.232524 -0.406706 -0.398942 0.180260 -0.351621 -0.277983 -0.217444 0.246696 -0.782503 0.202471 0.279905 0.274829 0.263579 0.303818 0.346830 0.264026 0.225754 0.223887 0.220295 0.340018 0.324558 0.259951 0.248827 0.218728
chargesum: 0.00000
title: Mulliken charges with hydrogens summed into heavy atoms:
elementType: O O N N N C C C C C C C C C C C C C
charge: -0.267507 -0.302252 -0.109759 -0.042736 0.054765 -0.122216 0.419439 0.128981 0.091959 0.232524 -0.143127 -0.134916 0.180260 -0.125867 -0.054097 0.002851 0.246696 -0.054997
polarizability: 1.84729797e+02 2.75782428e+01 1.75542833e+02 2.13955527e+01 -1.08375086e+01 1.19626124e+02
1716.lowfreq: -11.3579 -6.9156 -0.0010 -0.0008 0.0004 9.9803 23.5830 39.7990 47.6754
frequency: 23.3573 39.7342 47.6482 64.3116 79.8640 90.0558 105.0387 138.0031 149.4230 193.0921 215.8420 268.9109 307.2514 330.0258 338.0861 424.2683 437.6366 452.9297 484.5557 504.1189 508.2779 540.1598 553.4314 565.2749 576.2666 582.3416 604.0586 622.2866 645.2674 675.2736 697.6572 736.4771 751.0725 753.4786 771.2260 797.1032 838.6818 857.1365 866.6644 913.1629 932.6884 938.0201 975.8749 976.8955 992.3535 1011.8327 1044.1499 1058.0432 1071.2076 1095.6400 1133.1678 1136.3476 1167.6801 1180.7928 1224.0272 1240.3971 1243.5452 1259.7142 1287.0014 1298.0946 1340.7655 1353.3997 1378.4557 1385.2065 1393.8428 1422.6750 1450.1112 1457.2662 1464.2287 1469.2463 1483.7062 1488.5698 1558.7434 1585.0483 1588.1180 1600.5136 1630.7940 1643.8585 2976.9829 2993.2464 2994.5201 3064.3515 3085.5065 3113.5858 3121.8437 3129.6833 3142.9204 3160.4304 3218.3712 3480.4627 3518.7357 3612.8907 3671.4309
redmass: 5.3792 4.4244 4.7566 4.9548 1.3221 4.9803 3.0291 5.2983 4.1697 4.9170 3.9785 4.5320 3.6421 4.1324 3.2629 2.9109 3.0444 2.9779 3.2570 1.2138 1.2800 3.9376 5.4802 1.9924 2.9962 3.0833 2.8599 3.3388 2.5225 1.2529 4.1146 3.3901 2.4201 1.7927 3.2049 1.6833 3.1678 1.5048 5.0416 3.6948 2.8603 1.4233 2.3406 1.3026 1.6544 2.1754 1.6521 1.9853 3.5415 1.5950 1.5597 2.1981 1.1360 1.3231 1.4625 1.9163 1.7485 1.4324 1.9016 2.1014 1.5299 1.7169 2.6213 1.3226 4.6362 2.3349 1.1147 2.7671 1.1291 1.2576 2.8796 2.2479 6.0509 4.7580 2.7475 2.5903 6.7950 3.0367 1.0794 1.0367 1.0674 1.0974 1.0982 1.0998 1.0849 1.0893 1.0954 1.1001 1.0983 1.0780 1.0449 1.0809 1.1044
irintensity: 0.4816 1.3817 1.5234 0.7327 0.5221 24.2625 1.3406 3.1516 20.2299 0.3306 9.1016 1.2257 0.5286 0.2091 2.4719 10.6072 6.9914 13.9758 17.7920 111.8893 104.7490 18.8728 5.7012 97.9971 13.5960 7.9305 7.5495 21.5738 21.0080 135.9427 15.3951 9.1751 37.9255 82.3285 11.0537 7.1707 2.0550 2.1391 1.0962 1.4713 9.2002 6.3669 8.2834 1.0533 0.9500 12.0914 20.1639 3.1262 2.5955 36.1903 2.7009 2.8182 1.6721 5.2057 5.3427 15.7472 9.3490 7.4348 29.0075 0.9492 12.7029 10.2771 148.1360 112.5071 3.2899 9.1399 37.3607 7.2787 48.1040 17.7012 3.7961 216.3274 7.1601 46.8653 127.4029 95.4038 1.7406 213.5887 12.3498 11.9799 70.0708 6.2119 15.8659 12.3097 0.0841 6.6636 25.2277 29.9074 1.5130 81.9163 44.7569 58.0236 29.9863
temp: 298.150 k
press: 1.00000 atm
elementType: 8 8 7 7 7 6 6 6 6 6 6 6 6 6 6 6 6 6 1 1 1 1 1 1 1 1 1 1 1 1 1 1 1
symmnumber: 1
zpe: 692616.5 jmol-1
zpe.correction: 0.263804 hartree
zpe.thermalcorrener: 0.280733 hartree
zpe.thermalcorrenthalpy: 0.281677 hartree
zpe.thermalcorrgfe: 0.217636 hartree
zpe.sumelectzpe: -817.826832 hartree
zpe.sumelectthermal: -817.809903 hartree
zpe.sumelectthermalent: -817.808958 hartree
zpe.sumelectthermalfe: -817.873000 hartree
dipole: -1.2886 -4.8150 0.2642
dipole: 4.9914
quadrupole: -91.9135 -94.2512 -110.6590
quadrupole: 7.8607 12.4617 7.9674
quadrupole: 7.0278 4.6900 -11.7178 7.8607 12.4617 7.9674
hfenergy: -818.0906359 hartree
pointgroup: C01 [X(C13H15N3O2)]
dipole: 0.0266926 1.9607876 -0.1048267 debye
polarizability: 170.2316167|-25.8789799|190.6012685|-22.898989|-4.9928219|119.0658683 unknown
InChI: InChI=1S/C13H15N3O2/c1-8(17)16-12(13(14)18)6-9-7-15-11-5-3-2-4-10(9)11/h2-5,7,12,15-16H,6,14H2,1H3
charge 0 multiplicity 1
33 atoms
O  -2.358245 1.731506 -1.678593
O  -1.990626 -2.330706 1.037834
N  2.075007 1.971375 -0.358207
N  -1.908717 -0.64999 -0.556026
N  -3.021213 2.744944 0.299303
C  -0.980787 0.672884 1.392584
C  0.343012 0.937326 0.722594
C  -2.179286 0.420381 0.401243
C  1.39274 -0.04057 0.478832
C  2.466996 0.636516 -0.200594
C  0.800305 2.148198 0.199011
C  1.532542 -1.422359 0.782971
C  -2.526943 1.677103 -0.422602
C  3.657065 -0.022046 -0.582975
C  2.717577 -2.083063 0.406166
C  3.767653 -1.392199 -0.270824
C  -1.822206 -1.97034 -0.174001
C  -1.480965 -2.958302 -1.282785
H  -1.259336 1.508758 2.063731
H  -0.914652 -0.233858 2.018985
H  -3.050578 0.131934 1.024868
H  0.310678 3.120431 0.175376
H  2.625708 2.698851 -0.807972
H  -1.775966 -0.344499 -1.527124
H  0.732148 -1.963232 1.301085
H  4.467102 0.504614 -1.100337
H  2.842003 -3.146763 0.638128
H  4.676639 -1.936606 -0.550649
H  -3.273739 3.596953 -0.200929
H  -3.19026 2.688334 1.302087
H  -0.413313 -3.23334 -1.200641
H  -2.076066 -3.875468 -1.145216
H  -1.659176 -2.553069 -2.29372
