program: Gaussian 09
title: 000011027
version: EM64L-G09RevD.01
frameworkgroup: C1[X(C10H16O)]
method: RPBEPBE
basis: SDD
operation: Freq
keyword: #pfreq=noraman
keyword: PBEPBE/SDD
title: #p freq=noraman PBEPBE/SDD
converged: YES YES NO NO
title: Mulliken charges:
elementType: O C C C C C C C C C C H H H H H H H H H H H H H H H H
charge: -0.178276 0.435035 -0.277331 -0.623568 -0.141527 -0.631265 -0.114337 0.075745 -0.726453 -0.729934 -0.720997 0.244990 0.230378 0.238297 0.245635 0.255043 0.246055 0.190631 0.215966 0.242292 0.223724 0.217632 0.213734 0.224698 0.203855 0.217716 0.222260
chargesum: 0.00000
title: Mulliken charges with hydrogens summed into heavy atoms:
elementType: O C C C C C C C C C C
charge: -0.178276 0.435035 -0.032341 -0.154892 0.104108 -0.130168 0.076295 0.075745 -0.044471 -0.073870 -0.077166
polarizability: 1.17154403e+02 -1.88895578e+00 9.79851970e+01 1.49558460e-01 1.12439871e+00 9.47643949e+01
1716.lowfreq: -11.8135 -10.9177 -2.5783 -0.0004 -0.0002 0.0005 50.3586 72.1049 95.9017
frequency: 50.2978 71.8084 95.8462 180.5557 205.0982 212.3898 231.3896 244.4453 250.0630 291.9633 322.8589 410.4434 426.6877 454.1473 478.4676 520.8294 588.3345 625.4352 708.5872 739.3807 803.7195 840.4818 868.5806 907.1088 919.8936 933.8455 942.7323 956.7826 985.0552 1021.1793 1037.4865 1047.5058 1050.4190 1074.8468 1110.2491 1129.3180 1146.4194 1163.3155 1173.0080 1216.4124 1235.3389 1249.8359 1276.1078 1300.3024 1309.0236 1336.3571 1372.0325 1379.8508 1384.1386 1399.3565 1426.5152 1460.5694 1466.3178 1473.4917 1474.4340 1477.5485 1484.0200 1488.7974 1653.9979 2958.3103 2971.5144 2974.6967 2979.7836 2984.8912 2999.7619 3047.4175 3063.0683 3069.4395 3071.0335 3072.9493 3074.5748 3076.0363 3091.0840 3125.0236 3175.1784
redmass: 3.4336 2.8600 2.7660 2.9776 1.5359 1.4336 1.2809 1.6868 1.2494 2.5845 2.2485 2.8932 3.0703 3.4257 2.5261 2.8240 3.3131 3.4014 3.7863 2.5059 1.7352 2.7184 2.2738 1.6164 1.2834 1.4023 1.4702 1.5075 3.0829 1.3565 1.7996 1.3939 1.6624 1.8851 1.8485 2.1976 1.7356 1.8885 1.9194 1.5702 1.5861 1.6773 1.4780 2.2798 1.5293 1.6988 1.6812 1.2178 1.4985 1.2334 1.1003 1.2316 1.0470 1.0496 1.0502 1.0529 1.0444 1.0688 11.8365 1.0836 1.0353 1.0360 1.0349 1.0620 1.0834 1.0971 1.0992 1.0995 1.0967 1.0599 1.0995 1.1001 1.1004 1.0926 1.1138
irintensity: 3.1205 1.5826 0.0742 0.4992 0.8220 0.5230 0.9560 0.1337 0.0946 0.2781 1.0604 1.2380 3.3262 3.8109 2.2846 0.9772 1.0233 4.0097 5.8012 4.6372 9.9262 4.4818 4.0889 8.3363 3.3597 5.3429 5.2681 2.9509 0.5569 0.1236 43.0659 0.4341 6.0470 14.8658 20.6578 3.8793 8.9677 17.6640 22.4551 3.0814 19.9774 5.1437 0.9770 0.6565 0.3376 6.6811 6.3332 20.8268 7.5816 14.6495 9.9131 10.3568 0.7865 4.9197 12.2259 8.2467 13.5982 15.9409 183.8560 23.0909 34.3684 21.1705 26.7748 15.7336 16.2038 9.6203 8.7286 38.1140 56.1039 24.5032 68.5642 25.2354 20.6451 14.2135 18.8915
temp: 298.150 k
press: 1.00000 atm
elementType: 8 6 6 6 6 6 6 6 6 6 6 1 1 1 1 1 1 1 1 1 1 1 1 1 1 1 1
symmnumber: 1
zpe: 615001.3 jmol-1
zpe.correction: 0.234242 hartree
zpe.thermalcorrener: 0.246168 hartree
zpe.thermalcorrenthalpy: 0.247112 hartree
zpe.thermalcorrgfe: 0.196828 hartree
zpe.sumelectzpe: -464.991646 hartree
zpe.sumelectthermal: -464.979719 hartree
zpe.sumelectthermalent: -464.978775 hartree
zpe.sumelectthermalfe: -465.029059 hartree
dipole: 2.5234 2.0023 1.0926
dipole: 3.4016
quadrupole: -74.2999 -69.7848 -68.2675
quadrupole: -6.0079 -3.5843 -1.9054
quadrupole: -3.5159 0.9993 2.5166 -6.0079 -3.5843 -1.9054
hfenergy: -465.2258873 hartree
pointgroup: C01 [X(C10H16O1)]
dipole: 1.0047612 -0.8441393 0.2624956 debye
polarizability: 117.1403161|1.9611489|97.764099|-0.0720781|-1.4067045|94.99958 unknown
InChI: InChI=1S/C10H16O/c1-6(2)10-4-8(10)7(3)9(11)5-10/h6-8H,4-5H2,1-3H3
charge 0 multiplicity 1
27 atoms
O  -2.509399 1.607117 -0.464514
C  0.716554 -0.118895 -0.351267
C  -0.309006 -1.284011 -0.360239
C  0.444741 -0.901996 -1.64629
C  -1.724534 -0.73705 -0.191638
C  -0.07289 1.187358 -0.222294
C  2.08377 -0.258654 0.329447
C  -1.561896 0.798302 -0.323668
C  -2.354813 -1.079177 1.185684
C  3.109802 0.735524 -0.268688
C  1.993963 -0.112173 1.868457
H  -0.060265 -2.236015 0.120581
H  -0.11642 -0.419609 -2.456091
H  1.226731 -1.585106 -1.994512
H  -2.412441 -1.082724 -0.987958
H  0.167558 1.945457 -0.98997
H  0.08662 1.670887 0.762928
H  2.44456 -1.287615 0.114552
H  -1.693071 -0.765748 2.014432
H  -3.326736 -0.569431 1.303896
H  -2.517551 -2.168783 1.272254
H  2.807539 1.781145 -0.069063
H  4.112022 0.586566 0.174022
H  3.194036 0.610066 -1.363888
H  1.700913 0.913816 2.161586
H  2.973147 -0.319426 2.338225
H  1.253467 -0.814526 2.294317
