program: Gaussian 09
title: 000094189
version: EM64L-G09RevD.01
frameworkgroup: C1[X(C8H16O2)]
method: RPBEPBE
basis: SDD
operation: Freq
keyword: #pfreq=noraman
keyword: PBEPBE/SDD
title: #p freq=noraman PBEPBE/SDD
converged: NO YES NO NO
title: Mulliken charges:
elementType: O O C C C C C C C C H H H H H H H H H H H H H H H H
charge: -0.274965 -0.237664 -0.125513 -0.383192 -0.387955 -0.361949 0.195649 -0.702028 -0.695978 -0.502115 0.230021 0.212908 0.192649 0.221226 0.201118 0.199863 0.213007 0.215321 0.215264 0.226999 0.218163 0.208338 0.211451 0.229696 0.239683 0.240000
chargesum: 0.00000
title: Mulliken charges with hydrogens summed into heavy atoms:
elementType: O O C C C C C C C C
charge: -0.274965 -0.237664 0.104509 0.022366 0.034388 0.050922 0.195649 -0.044443 -0.058026 0.207264
polarizability: 9.84788695e+01 -1.01786248e+00 9.44382413e+01 -4.08072206e-01 -5.61125346e-01 8.41882917e+01
1716.lowfreq: -5.6557 -0.0008 0.0005 0.0007 7.9211 11.6676 30.6373 65.2679 70.7868
frequency: 30.3926 65.2567 70.7346 77.5031 97.4665 125.0931 138.7235 185.9679 209.7875 228.2255 241.1706 284.8435 312.2884 350.3239 438.1893 514.9540 591.2491 704.8199 743.6023 757.2436 798.9407 869.9985 887.5388 901.8339 960.9471 1011.6876 1032.6813 1054.1513 1057.5401 1090.9043 1110.4035 1111.9337 1141.3539 1151.4758 1197.0550 1228.7060 1260.6294 1266.9639 1292.5456 1308.9324 1329.2022 1331.6349 1356.8306 1391.3709 1395.0299 1423.0498 1451.3940 1456.7726 1464.9147 1468.1715 1472.1736 1477.5221 1477.7330 1481.1182 1485.4685 1634.4270 2969.1060 2973.6401 2976.9945 2978.4241 2985.8514 3002.0335 3006.8295 3015.0407 3040.3896 3049.2809 3070.0858 3074.1571 3076.0423 3078.4613 3101.6309 3146.1809
redmass: 5.0929 3.0450 2.1545 1.7248 1.1364 3.0392 1.8807 2.3406 2.6520 1.1648 1.4845 2.8511 3.4170 3.9058 3.4309 3.6448 2.6084 2.6581 1.3604 3.9654 1.3681 1.4121 2.2257 1.6446 3.0182 2.5526 1.7986 1.8028 2.3146 2.6164 1.6408 1.6040 1.8990 1.7838 2.7327 1.4196 1.3366 1.2018 1.1348 1.2893 1.3868 1.3638 1.5167 1.2131 1.2119 1.1790 1.0503 1.0777 1.0508 1.0743 1.0683 1.0427 1.0442 1.0557 1.0730 9.2400 1.0575 1.0389 1.0586 1.0373 1.0610 1.0298 1.0875 1.0964 1.1015 1.0999 1.1009 1.0993 1.1002 1.1000 1.1042 1.1045
irintensity: 1.0490 0.0681 0.0656 0.0197 0.1449 0.6185 2.3283 3.8181 5.5143 0.7151 1.2926 1.2234 9.2012 0.8094 2.5658 6.2524 0.1302 2.9645 6.3610 10.7616 18.1304 4.0037 3.7806 1.3010 17.9676 15.3636 10.7338 37.2052 68.7004 24.3690 6.2490 5.7350 9.9579 1.5993 78.6386 12.3179 21.6295 5.7487 4.4187 2.6982 1.1436 4.5584 0.8872 15.7427 9.4237 13.9868 12.5735 0.2033 9.0035 3.5857 4.7352 21.4345 1.7767 7.3622 13.7687 169.9462 6.8355 30.6216 34.0264 41.9604 50.3200 35.2308 5.5609 4.2907 2.1238 18.7684 70.4018 47.8653 69.6302 60.8863 28.1581 16.4149
temp: 298.150 k
press: 1.00000 atm
elementType: 8 8 6 6 6 6 6 6 6 6 1 1 1 1 1 1 1 1 1 1 1 1 1 1 1 1
symmnumber: 1
zpe: 595411.4 jmol-1
zpe.correction: 0.226780 hartree
zpe.thermalcorrener: 0.239974 hartree
zpe.thermalcorrenthalpy: 0.240918 hartree
zpe.thermalcorrgfe: 0.186153 hartree
zpe.sumelectzpe: -464.069497 hartree
zpe.sumelectthermal: -464.056304 hartree
zpe.sumelectthermalent: -464.055360 hartree
zpe.sumelectthermalfe: -464.110125 hartree
dipole: 0.2843 -0.1918 -1.8927
dipole: 1.9236
quadrupole: -61.2896 -56.1992 -68.2563
quadrupole: -1.6040 3.4819 -4.1812
quadrupole: 0.6254 5.7158 -6.3413 -1.6040 3.4819 -4.1812
hfenergy: -464.2962773 hartree
pointgroup: C01 [X(C8H16O2)]
dipole: 0.1115005 0.0771004 0.7445453 debye
dipolederiv: -0.4052444 -0.2513244 0.1111754 -0.2694754 -0.9075175 0.3339221 0.1655202 0.4342061 -0.8573384 -0.3621141 -0.120859 -0.1565904 -0.1497441 -0.5536503 -0.2431117 -0.0163953 0.0687103 -0.8776234 -0.0968856 -0.0316836 -0.0354582 -0.0225665 -0.1130413 -0.080378 -0.041663 -0.1392167 0.0315719 0.0850146 0.1020131 -0.0018519 0.0407758 0.0677263 -0.0367343 0.0496498 0.0013361 0.0964073 0.049585 -0.0615244 -0.0181288 -0.0125092 0.1624795 -0.0144837 -0.0270892 0.0617739 0.1120411 0.0335861 0.0356926 -0.0202259 0.0327828 0.123383 -0.0395462 -0.0530721 -0.03366 0.10906 0.3362237 0.3662789 0.0830861 0.4120688 0.9947437 -0.0230321 -0.1016066 -0.4087014 1.3606853 -0.0672304 0.0457327 -0.0366737 0.0510641 0.0576037 -0.0084109 -0.0144574 -0.0221926 0.0628673 -0.0634652 0.0253575 -0.0356916 0.0431479 0.0851457 -0.0027944 -0.0004826 -0.0072168 0.0684273 0.3286796 0.1228838 -0.0596395 0.1275591 0.551861 -0.1285308 -0.0341531 -0.0665107 0.2493827 0.0432794 -0.0172392 0.0121743 -0.0237012 -0.0009899 0.0440523 0.0137412 0.0620839 -0.1059285 0.0493291 0.0122712 0.036373 0.0172649 0.0501066 0.0756052 0.0149493 0.0509095 -0.1158169 -0.0044732 -0.1011214 -0.0189924 -0.0751986 -0.1591241 -0.0478414 -0.0172142 -0.0389802 0.0625335 0.0374558 0.0242772 -0.0081441 0.0154969 0.056405 0.0998401 0.0086618 0.0544094 -0.1132711 -0.0285222 -0.0972224 -0.0242542 -0.0992956 -0.1460914 -0.0480592 -0.0154409 -0.0429365 0.0690181 0.0310885 0.0188149 -0.0143685 0.007703 0.0338748 0.1004605 0.0152238 0.0665575 -0.1560338 -0.0047642 -0.0879838 -0.0207783 -0.0876535 -0.1461904 -0.0429384 -0.0111936 -0.0234199 0.0573375 0.0636518 -0.0243302 0.0431287 -0.0023948 0.0561569 0.0779305 -0.0211412 0.1074541 -0.1288397 -0.0421754 0.1198303 0.0609549 0.1311904 -0.029564 -0.0821199 0.0872409 -0.1039435 0.0171014 0.0166271 -0.0954462 -0.022417 -0.1334698 -0.0971032 -0.0143613 -0.0266215 -0.0021176 0.074999 -0.0962007 0.0984844 0.0683392 0.1314605 0.0124655 -0.0745281 0.1020104 -0.0836352 0.0191153 0.0306572 -0.0609472 -0.0208109 -0.1322569 -0.1443398 -0.0269264 -0.0357359 -0.0120922 0.0811508 0.0706873 -0.0210127 0.0365127 -0.0047267 0.0509831 0.0918633 -0.0338753 0.0972358 -0.143578 0.1056643 -0.0226494 0.005768 -0.0276986 0.0488425 0.0464611 0.0327307 0.1005151 -0.0966775 -0.0068704 0.0687122 0.0752107 0.0209744 -0.0647866 -0.0053522 0.0669248 -0.1039136 0.0512373 -0.1035837 -0.0470046 -0.0386975 0.0092024 0.0106214 0.0490141 -0.1065111 -0.0166546 0.0721717 unknown
polarizability: 98.5278775|0.9127222|94.3791086|0.4320721|-0.6327988|84.1984164 unknown
InChI: InChI=1S/C8H16O2/c1-4-6-7(5-2)8(9)10-3/h7H,4-6H2,1-3H3
charge 0 multiplicity 1
26 atoms
O  -0.890057 -1.145403 0.773391
O  -1.003699 -1.024331 -1.546112
C  -0.050324 0.874637 -0.2577
C  1.356509 0.750739 0.394144
C  -0.97811 1.805349 0.575695
C  2.358925 -0.097341 -0.420561
C  -0.685915 -0.49833 -0.454247
C  -2.365669 2.033169 -0.059748
C  3.755729 -0.145726 0.234594
C  -1.501235 -2.49237 0.694552
H  0.057966 1.293793 -1.277127
H  1.244384 0.321908 1.408966
H  1.763786 1.774858 0.519292
H  -1.091823 1.375558 1.58878
H  -0.459646 2.77769 0.692647
H  2.440849 0.314085 -1.446768
H  1.969051 -1.128791 -0.532129
H  -2.276244 2.457953 -1.07687
H  -2.967371 2.732022 0.549153
H  -2.932685 1.087607 -0.142469
H  4.458198 -0.759397 -0.358275
H  4.187777 0.868773 0.326294
H  3.701607 -0.579777 1.250821
H  -1.581489 -2.827258 1.738242
H  -0.859845 -3.170775 0.10675
H  -2.493968 -2.43694 0.216486
