program: Gaussian 09
title: 000094176
version: EM64L-G09RevD.01
frameworkgroup: C1[X(C4H8O4)]
method: RPBEPBE
basis: SDD
operation: Freq
keyword: #p
keyword: freq=noraman
keyword: PBEPBE/SDD
title: #p freq=noraman PBEPBE/SDD
converged: YES YES NO NO
title: Mulliken charges:
elementType: O O O O C C C C H H H H H H H H
charge: -0.466672 -0.464458 -0.433195 -0.203730 -0.075663 -0.146063 -0.328918 -0.062870 0.247398 0.222206 0.201060 0.211061 0.201125 0.368714 0.368223 0.361784
chargesum: 0.00000
title: Mulliken charges with hydrogens summed into heavy atoms:
elementType: O O O O C C C C
charge: -0.097959 -0.096235 -0.071411 -0.203730 0.171735 0.076143 0.083203 0.138255
polarizability: 6.93987420e+01 3.98352849e-01 5.33006483e+01 4.77775426e+00 1.81372232e+00 4.79607486e+01
1716.lowfreq: -0.0012 -0.0012 -0.0009 9.8713 12.8871 15.2641 60.8071 87.4586 120.4193
frequency: 60.5621 87.4228 120.4110 173.7048 257.1267 268.3161 307.6631 363.8984 441.7865 472.9359 481.2325 553.5751 641.9420 695.7339 797.2637 849.6386 938.8677 973.0995 1001.7489 1038.0991 1058.7162 1079.4478 1161.7251 1209.6929 1251.2413 1264.9942 1296.7621 1322.1093 1342.5186 1375.2263 1381.8905 1397.6901 1459.5819 1616.6578 2939.1177 2954.7193 2967.5441 2986.6866 3076.3130 3414.0808 3534.1706 3540.4018
redmass: 4.4693 4.1701 5.7755 3.8572 3.4512 3.9949 3.8636 5.1306 1.2116 1.3878 1.8258 1.1897 2.8546 4.1483 3.9174 2.6442 1.5319 4.9667 2.6985 2.6421 3.5249 2.4794 1.1691 1.2546 1.1692 1.2574 1.3630 1.2539 1.2081 1.2698 1.3944 1.4158 1.0867 8.4412 1.0807 1.0759 1.0818 1.0830 1.0961 1.0645 1.0648 1.0654
irintensity: 2.0801 8.3630 4.2636 9.5455 17.2750 22.1618 13.5685 24.8332 144.5182 166.6056 37.4960 100.9372 22.2630 5.6417 41.3659 31.1498 2.4279 108.9797 55.4501 74.5272 16.8730 29.5710 26.1416 24.6899 48.3756 7.7284 43.5564 30.7528 28.3047 32.5480 26.6473 11.7471 3.2813 127.9326 12.0641 28.4474 87.2618 58.9045 28.4199 38.1995 20.3406 17.8237
temp: 298.150 k
press: 1.00000 atm
elementType: 8 8 8 8 6 6 6 6 1 1 1 1 1 1 1 1
symmnumber: 1
zpe: 323926.7 jmol-1
zpe.correction: 0.123377 hartree
zpe.thermalcorrener: 0.132452 hartree
zpe.thermalcorrenthalpy: 0.133397 hartree
zpe.thermalcorrgfe: 0.089193 hartree
zpe.sumelectzpe: -457.418220 hartree
zpe.sumelectthermal: -457.409144 hartree
zpe.sumelectthermalent: -457.408200 hartree
zpe.sumelectthermalfe: -457.452404 hartree
dipole: 0.8372 -0.6523 -1.1196
dipole: 1.5427
quadrupole: -61.0242 -45.9901 -47.3643
quadrupole: -0.3216 -3.3790 4.5219
quadrupole: -9.5647 5.4694 4.0952 -0.3216 -3.3790 4.5219
hfenergy: -457.5415968 hartree
pointgroup: C01 [X(C4H8O4)]
dipole: 0.3075387 0.1687065 0.4953222 debye
dipolederiv: -0.5771073 -0.1460454 0.0173543 -0.1186075 -0.4145565 -0.1477314 -0.041033 -0.2021919 -0.7514449 -0.5835299 0.1929875 -0.0704809 0.2410175 -0.5765853 -0.0602563 -0.0976553 -0.0242503 -0.4946399 -0.8163054 -0.0147195 -0.1980951 -0.0078309 -0.55194 0.0814149 -0.2706373 0.0777756 -0.2986551 -0.8228128 -0.1365685 0.1644283 -0.0148253 -0.4759566 0.0041589 0.3186149 0.1094657 -0.3641003 0.4273678 0.1713019 -0.0716429 0.1095564 0.2484521 0.1092144 0.0205032 0.1174495 0.5562956 0.0474 -0.406597 0.0130608 -0.3927451 0.0879161 0.1252184 0.1473102 0.1787026 0.2622334 0.5694254 0.112311 0.1091972 0.0399778 0.3282775 -0.0582432 0.066834 0.0120705 0.3043222 0.8502675 0.1356586 -0.3074075 0.227647 0.6578616 -0.0538534 -0.5006885 -0.1539433 0.234482 -0.0042213 -0.0678478 0.0405341 -0.0583637 -0.0755755 0.0877543 0.0297323 0.0414959 -0.0685949 0.0622918 0.0264676 0.0159518 0.001736 0.0039864 -0.0376946 0.0292783 -0.0825627 -0.1277206 -0.084402 -0.1126336 0.0242789 -0.1038521 -0.1057595 0.0627185 0.0603193 0.1134615 0.0159079 0.0593995 -0.0047462 0.0006516 -0.0126637 0.0687095 -0.0370835 -0.0140361 -0.0761147 -0.122015 0.0062141 0.1110268 0.060436 0.1044688 -0.1481121 -0.0361343 0.0509881 -0.0468403 0.0807112 0.3030554 0.1678591 0.0555686 0.1386184 0.2318072 0.0306942 0.0343087 0.066665 0.3333368 0.2146388 -0.0199166 0.0435421 -0.1281268 0.3792279 0.0207662 0.0565684 -0.041384 0.3055268 0.3483185 -0.0085381 0.1026227 -0.0260067 0.3422472 -0.0909433 0.1095929 -0.0897991 0.1343547 unknown
polarizability: 69.8634926|-0.2241656|52.5320712|-3.5301422|2.7302664|48.2645753 unknown
InChI: InChI=1S/C4H8O4/c5-1-3(7)4(8)2-6/h1,3-4,6-8H,2H2
charge 0 multiplicity 1
16 atoms
O  -0.646948 -0.741172 -1.208486
O  1.480912 -1.478654 0.436149
O  -3.012141 0.324235 -0.056693
O  2.537967 0.886872 -0.281032
C  -0.717894 -0.488799 0.234526
C  0.716579 -0.292193 0.800782
C  -1.673955 0.699842 0.392628
C  1.426008 0.962763 0.298861
H  -1.151146 -1.370663 0.7520
H  0.64476 -0.201097 1.908484
H  -1.294238 1.567657 -0.187671
H  -1.783301 0.985048 1.452763
H  0.939069 1.942675 0.502299
H  -0.00794 -1.489566 -1.343324
H  2.354215 -1.162377 0.064784
H  -2.915549 -0.052372 -0.970471
