program: Gaussian 09
title: 000094198
version: EM64L-G09RevD.01
frameworkgroup: C1[X(C16H16FN)]
method: RPBEPBE
basis: SDD
operation: Freq
keyword: #p
keyword: freq=noraman
keyword: PBEPBE/SDD
title: #p freq=noraman PBEPBE/SDD
converged: YES YES NO NO
title: Mulliken charges:
elementType: F N C C C C C C C C C C C C C C C C H H H H H H H H H H H H H H H H
charge: -0.215016 -0.149464 0.399067 0.542355 -0.359698 -0.372827 -0.418051 -0.436503 -0.331842 -0.647312 -0.645615 0.334432 -0.318963 0.159153 -0.372702 -0.382704 -0.251039 -0.216757 0.235840 0.235736 0.225053 0.221130 0.211902 0.236245 0.217180 0.235945 0.217151 0.235242 0.235532 0.242445 0.227276 0.250315 0.224828 0.231666
chargesum: 0.00000
title: Mulliken charges with hydrogens summed into heavy atoms:
elementType: F N C C C C C C C C C C C C C C C C
charge: -0.215016 -0.149464 0.399067 0.542355 -0.123858 -0.137091 -0.192998 -0.215373 -0.119940 0.042057 0.042310 0.334432 -0.076518 0.159153 -0.145426 -0.132389 -0.026211 0.014910
polarizability: 4.74668265e+02 -5.79044254e+00 1.75010581e+02 1.41057411e-02 -8.53313005e-02 8.05836111e+01
1716.lowfreq: -9.0626 -6.0772 0.0001 0.0005 0.0006 2.5862 20.1501 33.6472 50.0873
frequency: 19.6941 33.6401 50.0709 69.0445 81.3668 105.6641 144.9741 157.8884 185.7859 190.3991 198.2428 236.8242 257.3248 288.1085 365.7997 375.7222 408.0561 421.0948 455.5084 460.4948 481.2242 516.3389 524.6654 536.6377 551.4553 601.3631 635.9620 711.6079 717.3485 744.2252 755.8171 768.3501 803.9328 819.2576 833.9687 850.4472 865.2305 883.7199 931.4457 943.0375 943.8968 956.6352 971.3860 986.2414 994.3519 1031.4591 1054.0495 1075.5698 1106.6091 1109.4812 1133.9758 1160.9826 1165.5274 1171.5022 1198.7272 1214.0132 1248.0033 1260.7212 1288.2657 1302.4561 1311.4023 1338.7271 1365.2925 1378.8562 1391.0131 1427.6657 1441.3739 1447.0756 1457.3403 1462.9551 1473.0067 1474.7724 1492.8816 1506.1947 1531.2983 1552.4497 1571.3591 1608.6717 1628.2360 1644.6410 2939.2639 2947.1923 3005.2131 3008.3428 3083.0579 3094.7382 3105.6886 3114.7826 3130.1876 3132.3116 3136.7404 3148.0428 3160.9778 3163.6889 3167.6126 3177.6502
redmass: 3.8951 4.5487 5.2383 2.3548 4.0344 1.9793 1.7298 5.0438 6.1140 2.9424 1.2148 2.1961 4.0459 3.6882 4.3335 3.8706 4.6845 2.9209 3.2108 4.3589 4.3163 2.5193 4.3845 5.5231 3.1675 5.8625 7.1008 4.9687 3.3358 3.1814 1.3051 6.2381 1.2837 1.7245 5.7210 1.4241 4.1999 2.0637 1.3737 3.1142 1.4058 1.3597 1.3068 1.1532 2.8995 2.0404 1.4989 2.8948 1.2391 1.3216 1.5604 1.2908 1.5646 1.7113 1.4583 1.6033 1.3911 2.8757 1.6497 2.3568 1.4277 1.4330 3.2132 4.8855 4.1396 1.2559 2.5951 2.5880 1.2770 1.0405 2.5928 1.0463 1.1039 1.1108 2.7538 6.1521 5.8731 6.4403 5.9859 5.6728 1.0366 1.0392 1.0995 1.1027 1.0891 1.0964 1.0942 1.0891 1.0887 1.0853 1.0872 1.0902 1.0951 1.0931 1.0939 1.0993
irintensity: 0.3756 2.3008 1.2604 0.0004 0.2564 4.6121 0.0583 0.5199 0.0641 0.1459 0.0065 3.2640 0.4730 0.2557 3.9857 0.5822 2.5043 0.0013 4.5470 9.0565 3.5630 17.3769 5.6881 9.3814 8.5019 4.3224 0.3488 5.7887 0.5745 9.7607 81.9654 13.6474 4.8555 76.9598 8.8851 0.0964 0.5810 1.3598 0.6786 34.1186 3.2574 0.5768 6.2140 51.6751 0.1139 14.7088 26.2331 29.5503 0.0163 1.0757 2.3533 3.6630 9.9734 18.2294 115.3646 16.2969 16.0670 31.4174 1.8406 8.7448 19.6185 17.3437 264.6669 17.3554 5.4773 12.6573 26.1149 15.6467 12.3912 0.0204 35.3020 21.9696 2.3631 66.5248 330.2516 11.1147 28.0750 303.7312 377.5836 10.1582 108.3820 182.5749 8.7583 80.9357 18.7576 4.8608 51.7708 13.2735 26.4735 4.6370 8.8477 5.9200 23.2960 27.8383 21.6646 19.5030
temp: 298.150 k
press: 1.00000 atm
elementType: 9 7 6 6 6 6 6 6 6 6 6 6 6 6 6 6 6 6 1 1 1 1 1 1 1 1 1 1 1 1 1 1 1 1
symmnumber: 1
zpe: 720010.2 jmol-1
zpe.correction: 0.274237 hartree
zpe.thermalcorrener: 0.291125 hartree
zpe.thermalcorrenthalpy: 0.292069 hartree
zpe.thermalcorrgfe: 0.227815 hartree
zpe.sumelectzpe: -772.598377 hartree
zpe.sumelectthermal: -772.581489 hartree
zpe.sumelectthermalent: -772.580545 hartree
zpe.sumelectthermalfe: -772.644799 hartree
dipole: -4.4396 -1.3654 0.0130
dipole: 4.6449
quadrupole: -67.1389 -97.5422 -114.0800
quadrupole: -7.2348 -0.0785 -0.0488
quadrupole: 25.7815 -4.6218 -21.1596 -7.2348 -0.0785 -0.0488
hfenergy: -772.872614 hartree
pointgroup: C01 [X(C16H16F1N1)]
dipole: 1.7428628 -0.5074802 -0.2107474 debye
polarizability: 474.542016|6.4244372|165.8973564|-6.8987223|27.7622132|89.8230842 unknown
InChI: InChI=1S/C16H16FN/c1-18(2)15-11-8-13(9-12-15)7-10-14-5-3-4-6-16(14)17/h3-12H,1-2H3
charge 0 multiplicity 1
34 atoms
F  -3.377264 2.234986 0.881592
N  5.201801 0.2099 0.030324
C  3.818877 0.011609 0.002742
C  0.948874 -0.385514 -0.055714
C  2.909729 1.05763 0.375882
C  3.250732 -1.240033 -0.398873
C  1.523325 0.858223 0.344955
C  1.858958 -1.419627 -0.422724
C  -0.49155 -0.641985 -0.107449
C  5.753312 1.508186 0.438993
C  6.108396 -0.878683 -0.355028
C  -2.937658 -0.042053 0.139468
C  -1.499882 0.238782 0.201099
C  -3.876228 0.96893 0.483625
C  -3.50856 -1.292237 -0.252064
C  -5.267433 0.805088 0.457754
C  -4.901984 -1.493149 -0.289782
C  -5.790557 -0.447507 0.064301
H  3.293963 2.031602 0.691965
H  3.896769 -2.071616 -0.693434
H  0.871588 1.688451 0.639602
H  1.456836 -2.391823 -0.736706
H  -0.76151 -1.657643 -0.433555
H  5.413211 2.328251 -0.225788
H  6.852989 1.469832 0.392823
H  5.465828 1.770426 1.477601
H  7.151355 -0.536387 -0.266086
H  5.943997 -1.200477 -1.403795
H  5.985119 -1.767262 0.2972
H  -1.242802 1.253704 0.525369
H  -2.843228 -2.116214 -0.530184
H  -5.915511 1.64021 0.739369
H  -5.300774 -2.466459 -0.595566
H  -6.873817 -0.602541 0.035585
