program: Gaussian 09
title: 000094181
version: EM64L-G09RevD.01
frameworkgroup: C1[X(C12H22O4)]
method: RPBEPBE
basis: SDD
operation: Freq
keyword: #pfreq=noraman
keyword: PBEPBE/SDD
title: #p freq=noraman PBEPBE/SDD
converged: YES YES NO NO
title: Mulliken charges:
elementType: O O O O C C C C C C C C C C C C H H H H H H H H H H H H H H H H H H H H H H
charge: -0.283846 -0.283805 -0.255931 -0.256202 0.060450 0.060278 -0.374994 -0.375272 -0.520693 -0.521217 -0.707847 -0.707895 0.268480 0.269007 -0.689870 -0.689826 0.226185 0.226286 0.194320 0.211948 0.194500 0.211553 0.251764 0.276740 0.277086 0.251630 0.221300 0.213536 0.249566 0.221215 0.213550 0.249965 0.208554 0.233781 0.216570 0.208489 0.234135 0.216510
chargesum: 0.00000
title: Mulliken charges with hydrogens summed into heavy atoms:
elementType: O O O O C C C C C C C C C C C C
charge: -0.283846 -0.283805 -0.255931 -0.256202 0.286635 0.286564 0.031275 0.030781 0.007810 0.007499 -0.023445 -0.023165 0.268480 0.269007 -0.030965 -0.030692
polarizability: 1.86835055e+02 9.25504421e-03 1.30037357e+02 -3.89927594e+00 4.70217983e-02 1.20657475e+02
1716.lowfreq: -5.0632 -0.0005 0.0000 0.0003 3.0463 4.6138 8.7613 20.3969 36.2798
frequency: 8.2533 20.3853 36.2114 50.0797 59.0859 64.4601 82.1209 101.0822 117.1565 122.8592 143.1656 162.4230 201.3566 206.6042 214.1587 215.8731 225.4786 248.5180 255.7921 321.2141 344.3260 382.3338 397.3866 420.7981 453.9024 475.3178 500.1761 561.0479 571.5931 640.9457 702.9692 740.2433 744.2435 795.6018 813.8826 814.2999 844.8157 857.4205 910.5487 935.2210 966.8986 967.1255 993.7910 994.4118 1020.3167 1035.9994 1036.4931 1080.5683 1104.5351 1107.2194 1126.7203 1128.0810 1135.4872 1144.4105 1172.7704 1181.1392 1182.6454 1245.7282 1264.3044 1264.7648 1293.4676 1295.8087 1306.5382 1329.4588 1338.9527 1358.2939 1358.4694 1371.1063 1386.4708 1386.6978 1387.6649 1387.7832 1445.1173 1452.1634 1452.4028 1454.2989 1466.0621 1466.1402 1474.6302 1474.7094 1480.2363 1480.3398 1487.3446 1487.4472 1626.9064 1631.9372 2981.8183 2982.1923 2985.5233 2985.5494 2990.8774 2990.9926 2998.2684 3003.7954 3016.7358 3017.2473 3042.1316 3042.2170 3063.8378 3076.5547 3076.8536 3083.4891 3086.4255 3086.6493 3091.3613 3092.0749 3101.1413 3101.3643
redmass: 3.8060 3.1985 3.3890 4.8151 6.8013 4.4355 2.6285 1.9790 3.1051 2.0578 2.2553 3.6368 1.3988 3.0058 1.0616 1.1257 1.2720 4.0077 2.2282 4.2294 2.9795 3.1654 2.8983 2.7167 3.0022 2.8060 2.8099 2.5872 3.9129 6.7927 3.5836 2.1406 1.8528 1.6079 1.7408 1.7452 2.3153 2.1159 4.8435 4.3977 1.2735 1.2747 1.4287 1.4242 2.1494 3.1375 3.1349 3.5573 1.9201 1.9416 2.4267 2.3526 1.8383 2.5154 1.7011 1.9450 1.8696 1.2041 1.2305 1.2304 1.2756 1.2938 1.3688 1.2232 1.3923 1.7000 1.6964 1.9164 1.2144 1.2190 1.2229 1.2241 1.0748 1.0754 1.0755 1.0951 1.0569 1.0571 1.0449 1.0448 1.0453 1.0452 1.0536 1.0537 10.1544 9.1028 1.0376 1.0382 1.0545 1.0545 1.0401 1.0402 1.0646 1.0643 1.0870 1.0870 1.0992 1.0991 1.0939 1.0996 1.0996 1.0973 1.0987 1.0988 1.0999 1.0999 1.1007 1.1007
irintensity: 0.5619 0.0065 0.5854 1.2339 1.8075 0.3850 1.6275 0.5512 1.8555 0.6966 1.3645 0.9706 5.6702 11.6026 0.1699 1.1723 0.9817 0.4719 18.0982 6.1422 2.2157 2.1430 9.9860 0.3527 0.0847 3.2381 3.3415 3.9554 18.6243 1.9712 1.0368 0.5153 0.3170 10.4884 44.8647 5.8587 6.3285 0.6125 132.9444 0.4802 6.4037 15.6062 118.4452 9.6983 22.7521 6.8417 14.0996 1.1790 225.1480 0.7496 114.6518 26.3630 3.0771 432.1022 8.8069 0.5007 0.3638 91.6962 0.8316 0.4677 45.1780 0.2691 153.4730 0.4084 28.6020 2.1044 3.8410 0.0025 1.0545 0.9668 21.3545 52.9060 2.2505 2.6770 2.6819 63.2977 12.0682 13.3439 13.5455 6.2558 10.6831 17.1617 8.7254 14.4089 249.1591 66.8645 33.7805 36.5769 19.2563 3.6586 49.6803 21.6946 0.1176 31.7582 5.6917 5.6492 15.4020 11.8570 4.1349 41.6634 45.4574 9.4789 26.0528 18.2500 74.5838 52.2159 23.1248 21.3366
temp: 298.150 k
press: 1.00000 atm
elementType: 8 8 8 8 6 6 6 6 6 6 6 6 6 6 6 6 1 1 1 1 1 1 1 1 1 1 1 1 1 1 1 1 1 1 1 1 1 1
symmnumber: 1
zpe: 848716.5 jmol-1
zpe.correction: 0.323259 hartree
zpe.thermalcorrener: 0.343458 hartree
zpe.thermalcorrenthalpy: 0.344403 hartree
zpe.thermalcorrgfe: 0.270724 hartree
zpe.sumelectzpe: -770.100508 hartree
zpe.sumelectthermal: -770.080309 hartree
zpe.sumelectthermalent: -770.079365 hartree
zpe.sumelectthermalfe: -770.153043 hartree
dipole: 0.0003 1.3921 -0.0146
dipole: 1.3921
quadrupole: -72.0996 -98.6757 -105.6089
quadrupole: 0.0071 -3.4352 -0.0150
quadrupole: 20.0284 -6.5476 -13.4808 0.0071 -3.4352 -0.0150
hfenergy: -770.4237673 hartree
pointgroup: C01[X(C12H22O4)]
dipole: -0.0007475 -0.0456857 -0.5458028 debye
polarizability: 186.9653924|-2.5541742|120.6201247|0.1939243|0.9372859|129.9443692 unknown
InChI: InChI=1S/C12H22O4/c1-5-9(3)15-11(13)7-8-12(14)16-10(4)6-2/h9-10H,5-8H2,1-4H3
charge 0 multiplicity 1
38 atoms
O  -3.005465 0.370025 0.247315
O  3.009349 -0.319885 0.299768
O  -1.955963 -1.331874 1.453836
O  1.959601 1.569026 1.184241
C  -4.363541 -0.218807 0.554881
C  4.365931 0.318263 0.49648
C  -5.269684 0.20226 -0.611393
C  5.275194 -0.307247 -0.571323
C  -0.623308 0.492296 0.449038
C  0.625998 -0.403442 0.5184
C  -4.820762 0.301363 1.924097
C  4.821261 0.059592 1.938787
C  -1.892545 -0.275294 0.779177
C  1.896026 0.409327 0.708087
C  -4.846158 -0.399235 -1.967135
C  4.843015 0.022114 -2.015009
H  -4.236904 -1.318133 0.585658
H  4.236992 1.404341 0.325029
H  -6.302123 -0.114095 -0.362139
H  -5.278902 1.307827 -0.670573
H  6.304422 0.061233 -0.389576
H  5.296158 -1.403908 -0.420269
H  -0.733794 0.977345 -0.535525
H  -0.516048 1.315161 1.183565
H  0.5263 -1.095252 1.378471
H  0.730203 -1.043093 -0.374396
H  -4.88551 1.403985 1.920492
H  -5.819752 -0.104992 2.16696
H  -4.121945 -0.013971 2.717057
H  4.888066 -1.024788 2.137772
H  5.81893 0.505788 2.105421
H  4.119986 0.513607 2.658938
H  -4.861845 -1.505047 -1.935901
H  -3.822996 -0.079914 -2.231327
H  -5.526244 -0.074026 -2.774897
H  4.849939 1.113592 -2.195445
H  3.821409 -0.348857 -2.207674
H  5.522907 -0.446484 -2.749087
