program: Gaussian 09
title: 000094196
version: EM64L-G09RevD.01
frameworkgroup: C1[X(C9H12N2O7)]
method: RPBEPBE
basis: SDD
operation: Freq
keyword: #p
keyword: freq=noraman
keyword: PBEPBE/SDD
title: #p freq=noraman PBEPBE/SDD
converged: YES YES NO NO
title: Mulliken charges:
elementType: O O O O O O O N N C C C C C C C C C H H H H H H H H H H H H
charge: -0.255235 -0.468042 -0.440124 -0.440183 -0.324249 -0.411460 -0.273220 -0.178394 -0.376052 -0.194469 -0.138483 -0.071900 -0.052015 -0.359181 -0.182014 0.263920 0.131827 0.076865 0.239359 0.225549 0.291318 0.289689 0.197602 0.218842 0.396595 0.376671 0.346515 0.367916 0.356233 0.386117
chargesum: 0.00000
title: Mulliken charges with hydrogens summed into heavy atoms:
elementType: O O O O O O O N N C C C C C C C C C
charge: -0.255235 -0.071447 -0.063453 -0.083950 -0.324249 -0.025343 -0.273220 -0.178394 -0.008136 0.044890 0.087065 0.219418 0.237673 0.057264 0.164502 0.263920 0.131827 0.076865
polarizability: 1.81646048e+02 1.13171563e+01 1.44221159e+02 7.35378577e+00 4.26652492e-02 8.01494151e+01
1716.lowfreq: -11.2027 -4.2359 0.0006 0.0007 0.0014 8.2492 31.1078 46.8642 63.6444
frequency: 30.9660 46.8513 63.6303 92.2396 113.6738 148.6076 162.0125 183.7522 196.7059 248.1556 269.7238 278.2830 286.8649 299.5422 319.0491 335.5855 370.2766 391.6518 393.0554 409.7399 469.8923 479.9882 515.2023 535.0198 544.0692 596.1182 624.7521 674.9744 683.4424 693.3789 714.3255 714.8234 741.2203 771.5871 784.7816 799.9271 868.5065 893.9992 909.3495 963.6442 975.2953 991.1161 1028.7289 1039.7451 1053.6923 1065.6719 1075.5610 1094.9001 1176.8324 1180.8599 1197.5598 1209.3061 1226.7618 1228.8363 1239.2061 1253.6648 1255.0239 1280.3324 1312.4602 1323.6769 1331.5693 1336.1167 1352.3536 1380.4782 1386.3569 1389.9203 1419.3191 1437.9334 1467.3686 1603.8649 1614.9680 1671.0498 2932.4291 2973.5397 2988.8838 2995.2857 3031.8614 3100.8076 3166.9037 3367.9451 3430.2918 3460.6719 3525.0492 3575.8426
redmass: 6.7286 6.7877 6.9873 7.8499 4.5124 8.6087 5.0638 5.1264 7.6377 6.2267 4.8917 1.6996 3.2134 2.5631 8.1925 5.7715 7.5025 9.0237 6.2379 4.0431 3.3254 2.5002 1.7701 1.0822 5.1518 6.6279 4.8041 1.9743 1.7972 2.6803 4.6230 5.3085 7.6908 2.0593 5.0733 3.9738 3.3513 2.8498 1.4189 4.4650 2.1470 3.1571 3.8091 7.0750 4.0548 3.7491 2.5203 3.4318 1.2009 3.1098 1.2330 1.8765 2.2579 1.5466 1.2508 2.0254 1.2360 1.2408 1.3614 1.2471 1.5831 1.2030 1.4495 1.5960 1.6137 2.2099 1.4477 4.3755 1.0781 11.4462 4.4788 6.4275 1.0567 1.0861 1.1016 1.0871 1.0866 1.0885 1.0956 1.0651 1.0642 1.0648 1.0773 1.0668
irintensity: 0.2442 1.4362 6.1202 3.1679 6.3215 4.1122 9.4915 6.7061 2.5294 20.1914 17.1706 113.4405 48.0280 27.5176 6.0753 13.3691 1.2790 9.1167 3.6013 12.4887 81.1314 58.0386 59.0056 127.9323 28.8617 23.3492 7.9669 78.4378 48.2756 3.5404 28.5848 5.3837 1.6750 140.2513 38.6444 30.8247 3.9235 7.4963 46.0441 48.0309 32.7634 87.6724 47.2831 123.4441 63.1453 101.2535 24.0548 32.0210 0.5981 5.1808 53.1012 355.6481 41.8915 7.7702 86.7536 108.6081 5.7519 7.8336 36.4285 10.8268 108.9341 40.1078 11.0611 75.3685 121.3155 43.5368 0.9728 23.4860 6.2569 217.6866 607.6670 109.5865 45.6238 13.0023 75.8528 66.8907 11.2563 14.0571 56.5145 222.5036 84.2508 42.7031 69.2710 8.7650
temp: 298.150 k
press: 1.00000 atm
elementType: 8 8 8 8 8 8 8 7 7 6 6 6 6 6 6 6 6 6 1 1 1 1 1 1 1 1 1 1 1 1
symmnumber: 1
zpe: 584790.9 jmol-1
zpe.correction: 0.222735 hartree
zpe.thermalcorrener: 0.239310 hartree
zpe.thermalcorrenthalpy: 0.240254 hartree
zpe.thermalcorrgfe: 0.178466 hartree
zpe.sumelectzpe: -984.847310 hartree
zpe.sumelectthermal: -984.830735 hartree
zpe.sumelectthermalent: -984.829791 hartree
zpe.sumelectthermalfe: -984.891579 hartree
dipole: -0.3401 1.2111 3.3322
dipole: 3.5617
quadrupole: -122.5136 -102.9935 -103.5002
quadrupole: -6.5907 -7.6548 10.2528
quadrupole: -12.8445 6.6757 6.1689 -6.5907 -7.6548 10.2528
hfenergy: -985.0700447 hartree
pointgroup: C01 [X(C9H12N2O7)]
dipole: -0.234829 -0.5339718 -1.2741123 debye
polarizability: 177.6680441|-16.1804063|147.5573807|-9.4872181|-2.5803613|80.7911976 unknown
InChI: InChI=1S/C9H12N2O7/c12-2-4-5(14)6(15)8(18-4)11-1-3(13)7(16)10-9(11)17/h1,4-6,8,10,12-15H,2H2
charge 0 multiplicity 1
30 atoms
O  -1.537311 -0.572782 1.174987
O  -1.890864 2.549886 -0.540464
O  -3.921303 1.175963 0.460365
O  -1.741515 -3.132807 0.063359
O  0.864919 2.526552 -0.222734
O  2.904648 -2.58681 0.21655
O  4.504968 -0.440999 -0.52382
N  0.551477 0.261484 0.309394
N  2.676324 1.038681 -0.348836
C  -1.680588 1.117396 -0.566191
C  -3.054125 0.406201 -0.414867
C  -0.876263 0.602314 0.671743
C  -2.68319 -0.921136 0.274727
C  -2.295228 -2.024963 -0.719792
C  1.042671 -1.046711 0.423618
C  1.332759 1.345678 -0.091957
C  2.361009 -1.310604 0.136789
C  3.275613 -0.236849 -0.267397
H  -1.175371 0.798316 -1.500255
H  -3.5376 0.248653 -1.400849
H  -0.839579 1.375312 1.461485
H  -3.483239 -1.268244 0.946376
H  -1.552021 -1.652909 -1.459419
H  -3.212082 -2.331505 -1.267721
H  -0.980233 2.960894 -0.453001
H  -3.655828 2.131437 0.351077
H  0.321757 -1.804003 0.745278
H  3.270515 1.823045 -0.636661
H  -1.572121 -3.908776 -0.527358
H  3.874601 -2.507716 -0.012927
