program: Gaussian 09
title: 000094170
version: EM64L-G09RevD.01
frameworkgroup: C1[X(C9H15NO3S)]
method: RPBEPBE
basis: SDD
operation: Freq
keyword: #p
keyword: freq=noraman
keyword: PBEPBE/SDD
title: #p freq=noraman PBEPBE/SDD
converged: YES YES NO NO
title: Mulliken charges:
elementType: S O O O N C C C C C C C C C H H H H H H H H H H H H H H H
charge: 0.181608 -0.243188 -0.416246 -0.229989 -0.333584 -0.283453 -0.386128 -0.473810 -0.368327 -0.375081 -0.729850 0.227258 -0.487794 0.173313 0.227476 0.208838 0.192155 0.202467 0.280995 0.195491 0.200511 0.219381 0.219466 0.335272 0.289305 0.289052 0.253211 0.254252 0.377399
chargesum: 0.00000
title: Mulliken charges with hydrogens summed into heavy atoms:
elementType: S O O O N C C C C C C C C C
charge: 0.181608 -0.243188 -0.038847 -0.229989 0.001689 0.152861 0.008494 -0.192816 0.027674 0.063766 -0.151494 0.227258 0.019669 0.173313
polarizability: 1.69803938e+02 4.20292051e+00 1.21574385e+02 -9.13327860e+00 1.91768771e+00 9.36336246e+01
1716.lowfreq: -15.9062 -5.2287 -0.0008 0.0008 0.0014 2.3005 13.6427 20.8376 31.9195
frequency: 12.6439 20.7150 31.8149 43.8091 47.8818 75.9658 106.2183 121.6616 132.5386 144.1488 179.6482 232.0734 349.5539 366.5704 420.5402 455.3813 470.4851 493.7511 497.3633 501.6625 588.1805 592.1201 632.2701 640.7718 704.8014 724.6659 738.3029 758.1070 827.1631 847.5003 859.0962 907.0045 933.0882 980.4749 1014.1711 1035.0022 1044.8662 1080.2017 1091.5350 1101.8030 1112.5917 1122.5741 1141.7810 1175.9558 1222.2822 1224.8409 1233.1636 1252.5756 1268.3874 1287.1239 1291.5583 1295.8626 1312.7456 1338.2018 1354.1042 1356.5880 1375.3346 1392.8436 1437.4266 1440.9038 1450.1508 1462.7297 1469.7133 1483.5956 1643.5692 1669.0795 2953.9758 2961.8667 2986.6619 2987.2806 2994.6292 2996.2445 3001.4537 3018.4911 3033.2230 3045.6051 3057.1775 3063.6377 3115.5015 3512.4948 3546.0522
redmass: 9.5545 4.5922 3.2679 5.6203 1.9253 3.6973 3.3368 4.0594 2.5400 2.5994 5.6046 5.2571 4.1111 4.9633 7.1465 6.4527 3.0738 2.5932 2.1996 1.8617 4.7237 4.6762 1.7188 1.3037 3.9244 1.1123 3.2373 1.4788 1.7165 2.8131 4.6202 1.5528 1.6521 2.8562 2.7378 3.2203 2.7361 2.3707 2.6030 2.2156 1.7104 1.1683 1.5111 1.3756 1.3461 1.3416 1.3207 1.5183 1.2260 1.2558 1.3215 1.1336 1.7505 1.5176 1.4011 1.5760 1.8398 1.9666 1.0845 1.0924 1.0823 1.0672 1.0922 1.0996 7.7968 8.2647 1.0584 1.0592 1.0621 1.0611 1.0970 1.0596 1.0860 1.1018 1.1000 1.0565 1.1027 1.1031 1.1074 1.0640 1.0767
irintensity: 1.1259 0.5213 0.7333 0.7077 0.2443 1.9996 2.1743 1.8497 0.7164 0.0807 1.0260 3.2957 3.9201 14.9186 11.5365 4.6009 4.6780 45.6252 14.1856 26.9748 16.8732 4.8125 103.3150 133.5522 7.7338 15.9058 6.4939 0.5517 7.4976 1.5362 2.0914 6.1901 5.9166 46.1942 69.4921 54.6082 96.0738 23.6736 25.6856 7.9494 6.4301 0.4654 6.6856 28.1452 7.6210 28.5050 23.7848 3.1212 13.6090 37.4822 33.6588 2.2631 22.4878 25.3555 29.8048 10.2185 29.8441 55.8039 26.8531 3.7470 5.5483 0.0824 0.6161 21.3481 417.1110 212.7105 2.6147 42.6752 16.5446 6.3944 0.7312 38.1416 27.3809 16.8022 2.1805 13.3944 11.4426 102.0562 2.8309 20.4457 25.7891
temp: 298.150 k
press: 1.00000 atm
elementType: 16 8 8 8 7 6 6 6 6 6 6 6 6 6 1 1 1 1 1 1 1 1 1 1 1 1 1 1 1
symmnumber: 1
zpe: 615452.0 jmol-1
zpe.correction: 0.234413 hartree
zpe.thermalcorrener: 0.250249 hartree
zpe.thermalcorrenthalpy: 0.251193 hartree
zpe.thermalcorrgfe: 0.186045 hartree
zpe.sumelectzpe: -1029.363777 hartree
zpe.sumelectthermal: -1029.347941 hartree
zpe.sumelectthermalent: -1029.346997 hartree
zpe.sumelectthermalfe: -1029.412146 hartree
dipole: -2.7649 -2.7876 0.0736
dipole: 3.9269
quadrupole: -98.8824 -105.3596 -92.1066
quadrupole: -5.2206 6.1076 -0.4829
quadrupole: -0.0995 -6.5768 6.6762 -5.2206 6.1076 -0.4829
hfenergy: -1029.5981902 hartree
pointgroup: C01 [X(C9H15N1O3S1)]
dipole: 1.1155594 1.0662409 -0.0745252 debye
polarizability: 169.8011257|4.0027714|120.6202436|9.4652065|-5.0106994|94.5905783 unknown
InChI: InChI=1S/C9H15NO3S/c11-7-6-14-8(10-7)4-2-1-3-5-9(12)13/h8,10,12H,1-6H2
charge 0 multiplicity 1
29 atoms
S  -3.980939 1.764096 -0.117106
O  -4.58429 -2.190871 -0.322584
O  6.254062 0.168284 -0.630541
O  5.160005 -1.095987 0.980345
N  -2.95284 -0.671584 0.403797
C  -1.213404 1.053745 -0.173015
C  0.025808 0.323125 0.398755
C  -2.518378 0.717515 0.569435
C  1.333586 0.748286 -0.307192
C  2.575345 0.015473 0.245018
C  -4.992411 0.231126 -0.54394
C  -4.176842 -1.009083 -0.15283
C  3.869188 0.451815 -0.467501
C  5.104548 -0.2514 0.060387
H  -1.3448 0.814895 -1.245409
H  -1.05293 2.148448 -0.103665
H  -0.094375 -0.775118 0.290573
H  0.113057 0.52893 1.48609
H  -2.429128 0.970143 1.6430
H  1.466821 1.844506 -0.195013
H  1.239087 0.554552 -1.395778
H  2.44789 -1.078608 0.135328
H  2.673828 0.203849 1.331249
H  -2.33929 -1.43157 0.706509
H  -5.206116 0.202079 -1.623737
H  -5.940498 0.23387 0.016348
H  4.032766 1.542982 -0.366323
H  3.810617 0.261142 -1.557159
H  7.048031 -0.307941 -0.263543
