program: Gaussian 09
title: 000094156
version: EM64L-G09RevD.01
frameworkgroup: C1[X(C15H14O)]
method: RPBEPBE
basis: SDD
operation: Freq
keyword: #pfreq=noraman
keyword: PBEPBE/SDD
title: #p freq=noraman PBEPBE/SDD
converged: YES YES NO NO
title: Mulliken charges:
elementType: O C C C C C C C C C C C C C C C H H H H H H H H H H H H H H
charge: -0.292193 -0.161714 -0.461600 -0.536036 0.373222 0.462584 0.155728 -0.406667 -0.382312 -0.385430 -0.440838 -0.255250 -0.217949 -0.225885 -0.226100 -0.240777 0.221795 0.236872 0.228049 0.233682 0.218574 0.229308 0.250814 0.260962 0.230020 0.225320 0.227340 0.225190 0.225268 0.228023
chargesum: 0.00000
title: Mulliken charges with hydrogens summed into heavy atoms:
elementType: O C C C C C C C C C C C C C C C
charge: -0.292193 0.060081 0.003321 -0.083781 0.373222 0.462584 0.155728 -0.177359 -0.131498 -0.124468 -0.210818 -0.029930 0.009391 -0.000695 -0.000832 -0.012754
polarizability: 2.29975168e+02 -2.78381896e+00 1.47640125e+02 3.85270690e+00 -9.43370339e+00 9.53599827e+01
1716.lowfreq: -12.5192 -0.0006 -0.0005 -0.0003 2.4709 5.4233 25.6288 43.2778 77.4707
frequency: 25.5262 43.2637 77.4675 139.9095 153.7827 240.1887 253.8639 268.2725 281.8894 369.9966 402.8392 427.9022 454.3409 509.0209 519.2986 532.6908 566.7827 586.3860 616.8604 643.7741 704.9902 713.2796 722.4275 759.1154 762.2188 811.4689 823.2698 855.7939 860.1599 872.0902 910.2070 923.5509 942.0546 975.4365 979.4851 982.6214 990.1143 997.6329 1025.5406 1026.5623 1044.3225 1067.0871 1083.8417 1102.8474 1164.6709 1167.2566 1172.0644 1183.9012 1187.9398 1196.4788 1219.2005 1223.6663 1272.0915 1286.9679 1308.8338 1327.1910 1336.3850 1354.9138 1385.5714 1387.8826 1438.7837 1443.6691 1454.0135 1459.9144 1480.6173 1485.0889 1587.5463 1595.6857 1616.7148 1618.5704 2958.7854 2967.2071 3004.3503 3034.2534 3069.4124 3112.5942 3113.2911 3126.6154 3133.5779 3140.2129 3153.5794 3155.7379 3167.2524 3168.3922
redmass: 3.7214 5.2760 4.5305 3.3660 3.4302 4.4275 4.4460 2.6769 4.7204 3.4249 2.8384 2.8627 3.7147 5.2466 3.5703 3.6009 5.1102 3.2809 6.2865 4.8821 1.7894 3.0754 4.7348 1.3661 1.8585 2.1774 4.6484 1.2584 1.4583 2.7669 2.6071 1.4628 1.3895 1.3059 1.3821 2.8417 5.9993 1.3404 2.4764 2.1424 2.1847 2.3211 1.5983 1.9347 1.1679 1.2181 1.0551 1.1712 2.1536 1.3897 1.8924 2.3548 1.3599 1.4455 1.3641 1.4023 1.4499 1.6172 8.1985 5.5904 2.2070 2.3420 1.1561 1.1142 2.3251 2.3891 6.7596 6.2009 6.1879 6.8674 1.0833 1.0659 1.0626 1.0940 1.1031 1.0876 1.0881 1.0865 1.0879 1.0923 1.0938 1.0960 1.0998 1.0997
irintensity: 0.2871 0.7219 0.3322 4.5329 1.1958 0.9279 0.5611 1.6708 1.0926 0.7948 0.5929 2.9796 6.5204 2.1804 6.3324 1.0539 7.8688 0.5875 0.3342 3.9341 48.2006 4.4284 7.5961 73.2926 72.1537 8.0622 5.0908 0.2926 1.3348 14.1716 17.6010 10.0281 3.9088 0.1014 0.0985 66.4161 0.5789 0.6236 3.0749 6.3013 17.0333 28.5743 6.4388 60.1477 12.4775 8.0843 0.0763 22.3979 61.5834 2.0664 8.0759 117.2344 9.4558 1.6458 12.6865 2.6709 2.7199 11.2245 9.3309 13.4802 30.3259 16.8398 5.9550 11.5396 77.4941 18.6258 36.1653 1.5332 1.2258 18.4104 21.3472 40.3705 22.6603 27.4883 28.6702 9.5915 11.1488 0.4907 10.5281 27.4884 28.4491 32.7406 14.3487 17.8083
temp: 298.150 k
press: 1.00000 atm
elementType: 8 6 6 6 6 6 6 6 6 6 6 6 6 6 6 6 1 1 1 1 1 1 1 1 1 1 1 1 1 1
symmnumber: 1
zpe: 644255.2 jmol-1
zpe.correction: 0.245384 hartree
zpe.thermalcorrener: 0.257993 hartree
zpe.thermalcorrenthalpy: 0.258937 hartree
zpe.thermalcorrgfe: 0.205183 hartree
zpe.sumelectzpe: -654.095043 hartree
zpe.sumelectthermal: -654.082434 hartree
zpe.sumelectthermalent: -654.081490 hartree
zpe.sumelectthermalfe: -654.135244 hartree
dipole: -0.4750 1.8812 0.3332
dipole: 1.9687
quadrupole: -84.6868 -86.7932 -95.6382
quadrupole: 0.3453 0.9656 -3.0807
quadrupole: 4.3526 2.2462 -6.5988 0.3453 0.9656 -3.0807
hfenergy: -654.340427 hartree
pointgroup: C01 [X(C15H14O1)]
dipole: -0.1871663 0.7426331 0.115605 debye
polarizability: 229.9610754|-2.6781681|147.2324942|4.1523193|-10.4980661|95.7817058 unknown
InChI: InChI=1S/C15H14O/c1-2-6-12(7-3-1)15-11-10-13-8-4-5-9-14(13)16-15/h1-9,15H,10-11H2
charge 0 multiplicity 1
30 atoms
O  0.336252 -0.671347 -0.31608
C  -0.5066 0.550755 -0.414385
C  -0.039753 1.596241 0.625711
C  1.416155 2.016453 0.332707
C  2.303062 0.795876 0.118914
C  -1.950241 0.124473 -0.219906
C  1.726383 -0.468593 -0.180897
C  3.712197 0.870099 0.234097
C  2.531376 -1.620204 -0.347082
C  -2.290535 -0.905599 0.691001
C  -2.982262 0.805004 -0.911388
C  4.530197 -0.266891 0.060876
C  3.931431 -1.518095 -0.226246
C  -3.644548 -1.243005 0.910565
C  -4.337264 0.473204 -0.687107
C  -4.672571 -0.552229 0.226998
H  -0.368969 0.971069 -1.433717
H  -0.124518 1.146935 1.633405
H  -0.717811 2.468101 0.592208
H  1.813073 2.627889 1.164355
H  1.438663 2.663101 -0.568779
H  4.170024 1.839122 0.471536
H  2.042976 -2.573379 -0.57287
H  -1.489625 -1.450723 1.20035
H  -2.727159 1.592966 -1.6318
H  5.618071 -0.182601 0.154024
H  4.55297 -2.410676 -0.357863
H  -3.898579 -2.04613 1.611686
H  -5.127041 1.005661 -1.228981
H  -5.722455 -0.815377 0.398365
