program: Gaussian 09
title: 000094131
version: EM64L-G09RevD.01
frameworkgroup: C1[X(C4H9N3)]
method: RPBEPBE
basis: SDD
operation: Freq
keyword: #p
keyword: freq=noraman
keyword: PBEPBE/SDD
title: #p freq=noraman PBEPBE/SDD
converged: YES YES NO NO
title: Mulliken charges:
elementType: N N N C C C C H H H H H H H H H
charge: -0.090847 -0.545121 -0.079912 -0.066053 -0.682778 -0.656615 -0.057087 0.218754 0.217881 0.240835 0.236411 0.203040 0.222782 0.234474 0.308356 0.295880
chargesum: 0.00000
title: Mulliken charges with hydrogens summed into heavy atoms:
elementType: N N N C C C C
charge: -0.090847 0.059115 -0.079912 0.152701 0.012349 0.003681 -0.057087
polarizability: 6.67103188e+01 6.93450115e+00 6.78220188e+01 -3.56973185e+00 -3.64995046e+00 5.08556635e+01
1716.lowfreq: 0.0001 0.0006 0.0007 4.7563 8.5627 16.5695 48.1781 136.0270 157.3679
frequency: 48.0998 135.9636 157.3630 208.3677 241.8742 284.5416 332.3492 347.5307 377.7946 437.4630 472.1954 502.8234 629.5569 693.3759 873.1704 918.8264 937.9088 1046.3103 1133.9057 1146.3599 1183.0232 1214.9227 1239.6609 1314.9573 1352.2915 1380.7401 1401.6673 1463.5098 1465.2160 1479.2099 1485.5992 1641.4543 2174.3824 2978.5291 2992.7188 2995.2891 3072.2417 3084.6326 3094.0319 3097.9744 3452.6676 3605.3414
redmass: 3.3272 3.4472 4.4377 1.0728 1.0692 2.1282 2.2969 1.3910 1.6315 2.6803 2.9762 5.0301 4.0313 4.8003 2.5337 1.2137 1.3605 2.0152 2.2934 3.0017 2.3939 1.3094 2.6035 1.4717 1.5090 1.2237 1.2112 1.0468 1.0479 1.0461 1.0506 1.0830 12.3921 1.0357 1.0374 1.0841 1.0990 1.1009 1.0994 1.1005 1.0409 1.1051
irintensity: 1.3558 3.1006 3.9736 0.0030 2.5333 39.1125 55.0835 56.4902 150.8888 19.9443 6.2278 21.1124 4.8820 2.6222 2.9360 2.5982 0.0982 5.4829 14.6361 8.7819 22.9920 1.3796 25.6324 5.4410 3.8466 27.1467 19.9839 0.5757 5.5751 15.3103 15.5729 8.5902 122.9992 22.5320 12.6454 20.8938 34.1637 7.2172 50.3736 25.0707 0.6753 7.0805
temp: 298.150 k
press: 1.00000 atm
elementType: 7 7 7 6 6 6 6 1 1 1 1 1 1 1 1 1
symmnumber: 1
zpe: 347490.3 jmol-1
zpe.correction: 0.132352 hartree
zpe.thermalcorrener: 0.141225 hartree
zpe.thermalcorrenthalpy: 0.142169 hartree
zpe.thermalcorrgfe: 0.099241 hartree
zpe.sumelectzpe: -321.449948 hartree
zpe.sumelectthermal: -321.441075 hartree
zpe.sumelectthermalent: -321.440131 hartree
zpe.sumelectthermalfe: -321.483059 hartree
dipole: 4.8605 3.3781 -1.3490
dipole: 6.0709
quadrupole: -51.9415 -40.7482 -41.6869
quadrupole: -5.2930 2.4711 0.6510
quadrupole: -7.1493 4.0440 3.1053 -5.2930 2.4711 0.6510
hfenergy: -321.5823 hartree
pointgroup: C01 [X(C4H9N3)]
dipole: -2.0181995 1.2559505 -0.2329894 debye
dipolederiv: -0.3758021 0.2128423 -0.0771772 0.401759 -0.1079347 -0.0027509 0.0530576 -0.1397819 -0.3440476 -0.8456207 -0.0772403 -0.0550873 -0.0686756 -0.0844258 -0.021748 -0.0367151 0.0377847 0.0135133 -0.4567563 0.1333775 -0.012953 0.1751398 -0.3866099 0.020415 -0.0102363 0.0119976 -0.2758955 0.6569996 0.0152349 0.1152378 0.1366991 0.094162 0.0369843 0.066504 0.0358917 0.4436759 -0.0381976 -0.0724547 -0.0122014 -0.0588973 -0.0821734 0.0577049 -0.0246778 0.0612784 -0.012645 -0.0677166 -0.0208807 -0.0259293 -0.0490365 0.0545409 0.0129728 -0.0875825 -0.0031077 -0.1642483 0.5040563 -0.5062957 -0.0042174 -0.6615425 0.381141 -0.0220898 -0.0117353 -0.0060087 0.0505988 -0.0451348 0.0656494 0.0205064 0.0809406 -0.0775074 -0.0873439 0.0267215 -0.072825 -0.022813 -0.1510387 -0.0739846 -0.0126132 -0.054625 0.0662963 0.0057883 -0.0354713 0.0052351 0.1040327 0.0526379 0.1013666 0.0546109 0.0670692 -0.0043054 -0.0345145 0.0731645 -0.0664575 0.0396742 0.1074583 0.007942 -0.0666424 0.0008608 0.0693933 -0.0073154 -0.0410965 0.019324 -0.1383435 0.1018527 -0.0566065 0.0401243 -0.0253033 -0.1266303 0.1340025 0.0236861 0.0869165 0.005197 -0.1581771 -0.0493947 -0.0452348 -0.0675468 0.0922888 -0.0148961 -0.0374818 -0.0032463 0.0784918 0.0335346 0.0967017 0.0641669 0.0827064 -0.015571 -0.0859513 0.0242516 -0.0386291 0.0353852 0.323947 0.1248885 0.1151151 0.0212733 0.0788698 -0.0080791 0.0706768 0.0134428 0.1334571 0.3579574 0.0988543 -0.0977052 0.0191789 0.0484658 0.0168213 -0.0530656 0.0581853 0.0539669 unknown
polarizability: 67.9055571|-7.2765434|67.2269797|2.0046986|-2.6943699|50.2554643 unknown
InChI: InChI=1S/C4H9N3/c1-4(2)7(6)3-5/h4H,6H2,1-2H3
charge 0 multiplicity 1
16 atoms
N  0.205077 0.553756 0.323419
N  0.57564 1.899916 0.100424
N  2.088887 -1.174373 0.26145
C  -1.222316 0.123457 0.113888
C  -1.481578 -1.227302 0.807001
C  -1.581292 0.084776 -1.390157
C  1.208782 -0.355438 0.270202
H  -1.827085 0.906646 0.612767
H  -2.548696 -1.494139 0.711606
H  -0.885082 -2.034855 0.34623
H  -1.225936 -1.178424 1.879641
H  -1.394907 1.0590 -1.880171
H  -2.651672 -0.154746 -1.524229
H  -0.986635 -0.688307 -1.90963
H  0.339397 2.530567 0.868262
H  0.429917 2.251465 -0.850504
