program: Gaussian 09
title: 000094153
version: EM64L-G09RevD.01
frameworkgroup: C1[X(C13H17NO5)]
method: RPBEPBE
basis: SDD
operation: Freq
keyword: #p
keyword: freq=noraman
keyword: PBEPBE/SDD
title: #p freq=noraman PBEPBE/SDD
converged: YES YES NO NO
title: Mulliken charges:
elementType: O O O O O N C C C C C C C C C C C C C H H H H H H H H H H H H H H H H H
charge: -0.263811 -0.228571 -0.247994 -0.424190 -0.191094 -0.347556 0.043599 -0.391986 -0.702881 0.111316 0.175960 0.232762 -0.347927 -0.353979 -0.246204 -0.234700 -0.526916 -0.330649 0.174336 0.178813 0.205961 0.265839 0.305548 0.212370 0.213012 0.226113 0.253332 0.241230 0.230973 0.227441 0.284122 0.191003 0.189047 0.233442 0.255274 0.386966
chargesum: 0.00000
title: Mulliken charges with hydrogens summed into heavy atoms:
elementType: O O O O O N C C C C C C C C C C C C C
charge: -0.263811 -0.228571 -0.247994 -0.037224 -0.191094 -0.042008 0.222412 0.079814 -0.051386 0.111316 0.175960 0.232762 -0.094595 -0.112749 -0.015231 -0.007259 0.137256 0.158067 0.174336
polarizability: 1.91418778e+02 3.70233526e+00 1.89607045e+02 1.26182288e+01 8.54932905e+00 1.14189749e+02
1716.lowfreq: -5.0934 -0.0007 -0.0006 -0.0006 3.1281 5.2372 22.0221 29.5268 40.1034
frequency: 21.9317 29.4864 40.0630 43.4340 49.0654 60.6238 72.4361 77.6778 103.8245 121.7074 156.8547 198.7943 200.6532 219.3761 231.6071 237.2379 255.1306 279.7062 336.5215 350.7155 366.8255 377.1109 418.2725 476.6841 490.7497 524.9112 543.6697 555.4649 570.8858 613.9579 627.2623 645.6239 655.2548 713.4384 748.7923 755.9390 767.5413 778.6901 817.9359 851.8789 884.0185 895.4005 913.4521 936.5156 974.5913 981.2339 990.3286 1007.7315 1028.1484 1043.9270 1055.0728 1063.1736 1097.3018 1115.7336 1121.3635 1128.0181 1159.2412 1166.2204 1175.6253 1204.2558 1223.0753 1248.5411 1258.2955 1266.9176 1279.5193 1311.5737 1321.3967 1354.1455 1368.5738 1379.3889 1390.7001 1427.3911 1437.6673 1449.4181 1453.9002 1459.7321 1466.1494 1471.0836 1482.2291 1484.4762 1489.2388 1589.6553 1598.4545 1617.0694 1700.9958 2914.4430 2922.7118 2947.6490 2978.5560 2990.9455 2995.1925 3034.2302 3074.9110 3078.1675 3080.2774 3116.4610 3130.8058 3139.4177 3157.4632 3170.3823 3521.3571 3547.1222
redmass: 4.8208 6.0973 6.6077 3.5866 5.3022 4.4362 3.0427 7.9570 2.8621 3.4668 5.3870 3.4674 1.1712 6.0917 1.3842 2.8581 4.2470 4.5147 3.3574 4.5210 3.7325 2.8925 2.8782 3.7623 3.3694 2.5937 3.8636 1.7234 2.1599 4.1358 2.9922 1.9830 3.7739 6.2727 3.3795 1.4302 2.6337 4.6814 4.8151 1.4485 4.3302 3.1549 1.9350 1.3878 1.3813 2.0354 2.1784 4.7697 2.9644 2.4419 2.8004 2.3773 2.2667 1.2672 2.1996 1.9020 2.0547 1.6282 1.0851 1.1029 3.1089 1.7028 1.3399 1.7891 1.4950 1.5827 1.3577 1.3099 2.8953 1.2382 2.7310 2.1547 1.1348 1.1537 1.0812 1.0585 1.0931 1.6022 1.5363 1.0625 1.4840 6.7436 6.7708 7.3636 9.3270 1.0782 1.0393 1.0617 1.0371 1.0657 1.1009 1.0970 1.0991 1.0979 1.0982 1.0964 1.0853 1.0903 1.0932 1.1000 1.0641 1.0770
irintensity: 1.4306 0.5723 4.8970 4.3999 1.2142 1.8652 0.7776 2.4318 6.2473 0.6678 5.7722 1.5465 0.8253 0.1835 1.4385 1.3262 4.6636 2.2081 2.0956 2.8484 10.4106 11.5102 8.8196 2.4419 19.5500 29.6165 12.1183 65.8857 31.5966 27.7972 26.9341 102.6958 27.8579 16.3173 4.6125 91.7431 3.8527 7.1631 10.9439 0.4178 0.8912 10.0483 4.4210 2.3894 1.3242 1.9476 124.8362 124.1747 52.2366 6.5433 188.8211 90.0772 2.2229 1.4273 20.1668 45.0264 27.7601 4.4363 3.4649 0.7275 138.8150 56.7399 57.9510 34.0691 19.9041 45.6587 12.3172 8.5215 11.6436 33.0393 1.8740 55.7995 7.1852 46.9584 18.6005 8.7050 20.9534 132.6838 21.4301 9.0736 143.7916 27.3275 37.9714 176.1338 241.9949 44.7206 123.2324 44.0870 11.9929 82.2940 77.7512 16.1966 43.4256 22.6797 20.9984 1.4521 0.7717 10.6333 28.4502 17.0734 35.0903 14.8956
temp: 298.150 k
press: 1.00000 atm
elementType: 8 8 8 8 8 7 6 6 6 6 6 6 6 6 6 6 6 6 6 1 1 1 1 1 1 1 1 1 1 1 1 1 1 1 1 1
symmnumber: 1
zpe: 745625.0 jmol-1
zpe.correction: 0.283994 hartree
zpe.thermalcorrener: 0.304128 hartree
zpe.thermalcorrenthalpy: 0.305072 hartree
zpe.thermalcorrgfe: 0.232291 hartree
zpe.sumelectzpe: -934.988225 hartree
zpe.sumelectthermal: -934.968090 hartree
zpe.sumelectthermalent: -934.967146 hartree
zpe.sumelectthermalfe: -935.039927 hartree
dipole: -0.0839 0.6963 -4.2711
dipole: 4.3283
quadrupole: -89.4017 -90.5751 -120.6008
quadrupole: -5.4260 2.3641 3.5677
quadrupole: 10.7908 9.6174 -20.4083 -5.4260 2.3641 3.5677
hfenergy: -935.2722181 hartree
pointgroup: C01 [X(C13H17N1O5)]
dipole: 0.0029797 -0.1908411 -1.6921601 debye
polarizability: 194.0021088|3.3712656|188.0490067|-12.1038817|-1.0331579|113.1644565 unknown
InChI: InChI=1S/C13H17NO5/c1-9(18-2)7-14-13(17)10-5-3-4-6-11(10)19-8-12(15)16/h3-6,9,14-15H,7-8H2,1-2H3
charge 0 multiplicity 1
36 atoms
O  -2.819762 -0.06494 -0.353848
O  0.891244 -1.075641 0.020448
O  -0.346747 0.868087 2.128083
O  0.880355 -4.662336 0.02549
O  -0.903301 -3.226586 -0.394874
N  -1.137187 2.043886 0.2664
C  -3.466067 1.243956 -0.228004
C  -2.537317 2.059156 0.706875
C  -3.699676 1.90658 -1.603456
C  1.179901 1.283627 0.27038
C  -0.162452 1.349901 0.97283
C  1.737861 0.035368 -0.12766
C  1.9427 2.458401 0.085981
C  3.046904 -0.027998 -0.663304
C  3.246189 2.408366 -0.463033
C  3.794716 1.161429 -0.827256
C  -3.682237 -1.152663 -0.809136
C  1.439361 -2.378887 -0.308831
C  0.313907 -3.401523 -0.225167
H  -4.447341 1.138672 0.292499
H  -2.913694 3.098562 0.781774
H  -2.542655 1.605317 1.712444
H  -0.925278 2.294721 -0.701039
H  -4.1448 2.912145 -1.484369
H  -2.750724 2.003105 -2.163237
H  -4.388554 1.305192 -2.223044
H  1.517485 3.417824 0.401684
H  3.494997 -0.983202 -0.952668
H  3.826082 3.328132 -0.589218
H  4.808178 1.104166 -1.239595
H  -3.052305 -2.053495 -0.75485
H  -4.568269 -1.270491 -0.147945
H  -4.032054 -1.006795 -1.853456
H  1.836644 -2.405093 -1.347121
H  2.25261 -2.668711 0.383105
H  0.164784 -5.354434 0.026018
