program: Gaussian 09
title: 000094142
version: EM64L-G09RevD.01
frameworkgroup: C1[X(C16H16FN)]
method: RPBEPBE
basis: SDD
operation: Freq
keyword: #p
keyword: freq=noraman
keyword: PBEPBE/SDD
title: #p freq=noraman PBEPBE/SDD
converged: YES YES NO NO
title: Mulliken charges:
elementType: F N C C C C C C C C C C C C C C C C H H H H H H H H H H H H H H H H
charge: -0.210150 -0.149292 0.398318 0.543285 -0.359540 -0.372276 -0.419287 -0.437995 -0.333364 -0.647472 -0.646053 0.529719 -0.351198 -0.371704 -0.390919 -0.379887 -0.383387 0.308291 0.234830 0.236083 0.218506 0.221369 0.212237 0.235297 0.217630 0.235305 0.235423 0.217277 0.235390 0.215235 0.226626 0.230530 0.250002 0.251170
chargesum: 0.00000
title: Mulliken charges with hydrogens summed into heavy atoms:
elementType: F N C C C C C C C C C C C C C C C C
charge: -0.210150 -0.149292 0.398318 0.543285 -0.124710 -0.136193 -0.200780 -0.216626 -0.121128 0.040760 0.042037 0.529719 -0.135963 -0.145078 -0.160389 -0.129885 -0.132217 0.308291
polarizability: 4.73277849e+02 -7.38703314e+00 1.72528612e+02 9.10931307e-03 1.44219380e-02 8.06026159e+01
1716.lowfreq: -4.6477 -0.0012 0.0003 0.0007 7.7775 9.3288 24.1892 29.7451 53.9053
frequency: 24.1485 29.6213 53.8873 67.6305 73.9273 108.9902 148.7665 152.2306 186.1058 201.5282 205.6625 243.2740 272.9981 342.7575 369.8055 383.7794 390.2906 414.1091 421.7503 448.0465 486.4689 496.3408 499.0979 536.2046 561.4782 628.9365 638.2157 712.2713 713.7505 741.1975 761.3565 802.8594 807.4669 813.6186 825.8940 829.4468 867.0123 882.2950 936.1028 944.4218 945.0073 951.8470 953.8994 980.1795 995.8797 1000.6564 1056.2988 1104.4285 1108.3830 1110.6921 1134.6948 1155.3646 1166.8344 1197.4099 1200.2588 1215.2831 1252.5618 1262.2960 1290.4662 1301.6949 1318.9037 1339.8130 1366.2025 1375.6594 1389.2768 1415.3693 1429.5272 1448.3639 1459.8938 1464.0595 1475.4733 1493.6621 1495.1293 1508.6827 1531.3726 1552.9855 1586.9954 1605.6438 1628.9904 1646.0496 2939.4018 2947.0503 3004.8959 3007.4237 3081.9296 3095.6369 3097.0563 3106.7562 3114.6859 3129.0548 3130.4015 3143.0605 3162.5698 3167.5179 3170.3355 3173.5576
redmass: 3.3637 5.6298 5.3975 4.9498 2.4519 2.2819 1.7084 5.8292 3.2140 4.7350 1.1334 2.1159 4.2271 3.6948 5.6087 4.2128 4.3420 3.0600 3.0485 4.0364 4.7199 3.6483 2.4717 2.2975 4.7160 7.2119 7.0705 4.9500 3.2832 3.3019 5.9197 1.2895 1.3276 1.5230 5.9296 1.6954 4.2771 1.9623 1.3362 3.1301 1.4577 1.3638 1.3639 1.1688 2.8901 2.7902 1.4939 1.3540 1.2389 1.3201 1.5702 1.4862 1.7259 1.6840 1.7284 1.6741 1.3469 2.8967 1.5682 2.0828 1.5170 1.4102 3.2224 4.6878 3.6701 3.5206 1.2757 2.6207 1.2209 1.0402 1.0460 1.7677 1.3496 1.1329 2.7258 6.1870 7.1132 6.0315 5.7427 5.5834 1.0369 1.0394 1.0990 1.1030 1.0904 1.0866 1.0959 1.0940 1.0892 1.0878 1.0894 1.0881 1.0933 1.0934 1.0958 1.0961
irintensity: 0.0284 0.5282 0.1267 1.6474 0.2144 3.9515 0.1081 0.4396 0.7666 0.5837 0.0430 3.9029 0.3449 0.6139 0.8933 8.3199 0.0178 0.0025 0.0035 3.9175 35.5145 2.3107 1.6596 44.6411 0.9039 0.0068 0.2996 0.1549 1.7342 2.9475 33.2518 0.0521 2.0851 5.8810 6.2900 139.3726 2.3525 4.8777 9.0835 34.7203 0.0943 0.3241 0.0785 53.9381 0.1025 3.6028 26.5271 11.8763 0.0176 1.0895 2.8614 57.6773 11.4441 108.6156 31.9577 44.0022 14.2117 30.9382 5.0025 3.7699 5.9741 8.2692 273.1942 21.2630 3.7142 2.4842 8.7384 7.5830 18.6461 0.0250 21.9679 108.9323 62.7532 28.2599 388.9490 7.5589 11.4074 72.7310 472.5244 8.8736 107.5577 181.4834 0.0373 90.7310 5.2531 40.4098 5.7315 52.0200 16.8996 8.3033 15.0126 9.3955 26.3882 22.4022 9.0314 9.6163
temp: 298.150 k
press: 1.00000 atm
elementType: 9 7 6 6 6 6 6 6 6 6 6 6 6 6 6 6 6 6 1 1 1 1 1 1 1 1 1 1 1 1 1 1 1 1
symmnumber: 1
zpe: 720219.3 jmol-1
zpe.correction: 0.274317 hartree
zpe.thermalcorrener: 0.291141 hartree
zpe.thermalcorrenthalpy: 0.292086 hartree
zpe.thermalcorrgfe: 0.228095 hartree
zpe.sumelectzpe: -772.597976 hartree
zpe.sumelectthermal: -772.581152 hartree
zpe.sumelectthermalent: -772.580207 hartree
zpe.sumelectthermalfe: -772.644198 hartree
dipole: 6.8673 0.4133 0.0058
dipole: 6.8797
quadrupole: -96.1246 -90.6544 -114.0650
quadrupole: -0.3981 0.0094 0.0000
quadrupole: 4.1568 9.6270 -13.7837 -0.3981 0.0094 0.0000
hfenergy: -772.872293 hartree
pointgroup: C01 [X(C16H16F1N1)]
dipole: 2.7005087 0.1826837 -0.0019328 debye
polarizability: 473.3706369|-5.1509706|172.4321423|-0.4077198|-0.5417097|80.606298 unknown
InChI: InChI=1S/C16H16FN/c1-18(2)16-11-7-14(8-12-16)4-3-13-5-9-15(17)10-6-13/h3-12H,1-2H3
charge 0 multiplicity 1
34 atoms
F  -6.949987 -0.252595 0.00673
N  5.418121 0.173376 -0.007701
C  4.028536 0.023417 -0.005886
C  1.145237 -0.278459 -0.003213
C  3.155746 1.162567 -0.011666
C  3.417053 -1.271424 0.001164
C  1.762793 1.008095 -0.010447
C  2.019795 -1.404108 0.002153
C  -0.303865 -0.493194 -0.0015
C  6.01539 1.514474 -0.015515
C  6.283033 -1.012691 0.000296
C  -2.739625 0.234807 0.00338
C  -1.287983 0.464915 0.001292
C  -3.334384 -1.064504 0.014365
C  -3.61616 1.361359 -0.005307
C  -4.731858 -1.233154 0.01539
C  -5.018342 1.214541 -0.004418
C  -5.547909 -0.086366 0.00571
H  3.572763 2.173671 -0.017694
H  4.033757 -2.174396 0.006047
H  1.140196 1.910139 -0.016029
H  1.585223 -2.412253 0.007619
H  -0.606217 -1.551204 -0.002292
H  5.72386 2.101981 0.879034
H  7.113219 1.426931 -0.018372
H  5.718897 2.093386 -0.91415
H  6.116422 -1.649564 -0.89238
H  7.338327 -0.697994 -0.001019
H  6.115289 -1.638346 0.900816
H  -0.990789 1.523395 0.001977
H  -2.699718 -1.956528 0.023269
H  -3.186163 2.37002 -0.013391
H  -5.189428 -2.227018 0.024024
H  -5.687726 2.079725 -0.011284
