program: Gaussian 09
title: 000094097
version: EM64L-G09RevD.01
frameworkgroup: C1[X(C11H10O6)]
method: RPBEPBE
basis: SDD
operation: Freq
keyword: #pfreq=noraman
keyword: PBEPBE/SDD
title: #p freq=noraman PBEPBE/SDD
converged: YES YES NO NO
title: Mulliken charges:
elementType: O O O O O O C C C C C C C C C C C H H H H H H H H H H
charge: -0.290121 -0.287056 -0.439835 -0.245812 -0.190464 -0.186037 0.326761 0.292812 0.290670 -0.490524 -0.327323 -0.317530 0.114647 0.244705 0.245802 -0.741643 -0.740206 0.291752 0.256449 0.280001 0.255027 0.248480 0.259108 0.256083 0.249447 0.257173 0.387635
chargesum: 0.00000
title: Mulliken charges with hydrogens summed into heavy atoms:
elementType: O O O O O O C C C C C C C C C C C
charge: -0.290121 -0.287056 -0.052201 -0.245812 -0.190464 -0.186037 0.326761 0.292812 0.290670 -0.198771 -0.070874 -0.037529 0.114647 0.244705 0.245802 0.020973 0.022497
polarizability: 2.00350447e+02 -7.71704057e-02 1.30687909e+02 1.52640363e+00 1.55849252e+01 9.50455254e+01
1716.lowfreq: -9.3311 0.0006 0.0007 0.0010 1.2598 4.5648 24.9388 37.8270 44.2334
frequency: 24.4822 37.7874 44.1208 48.6040 53.0164 65.4837 75.0551 81.8421 97.2275 143.4778 173.6314 218.0242 264.7223 277.5595 302.0794 331.4609 398.5600 419.8879 460.8601 514.9120 516.7237 525.6844 551.4052 561.1404 566.0186 596.4166 622.9319 647.6563 692.9614 702.8308 737.2828 769.9732 788.4897 842.5785 862.1584 915.2456 940.9091 980.1561 982.4712 987.9537 1036.7813 1038.1513 1041.7046 1081.8182 1132.8092 1145.0914 1166.6446 1176.9583 1225.6236 1247.4311 1324.7253 1383.8777 1385.4686 1388.0636 1415.8550 1450.5225 1451.2640 1451.7390 1453.1422 1481.6057 1583.1219 1615.8718 1644.8144 1688.0336 1697.8831 3009.9056 3010.2144 3097.1748 3097.3919 3146.0171 3146.5325 3165.3535 3171.6006 3189.4594 3533.3777
redmass: 5.2658 3.0520 2.1558 1.8295 8.1127 6.0966 1.5527 2.0071 5.6744 7.8260 7.5265 6.3076 4.4925 5.3410 6.1851 5.7226 4.4604 5.0446 3.9081 3.3985 5.4783 3.7113 3.2315 4.2488 4.1413 1.7510 3.5383 4.1381 5.6470 5.3052 4.8814 3.9732 6.6625 2.7660 2.3437 5.6352 1.5843 1.4433 2.0704 2.0888 2.1685 1.9113 1.6577 3.3870 1.6033 1.9773 3.2824 2.1484 3.0510 1.4830 2.6179 1.2542 1.2352 8.5636 4.8191 1.0484 1.0476 1.0531 1.0571 3.2441 8.8037 7.2399 8.8607 10.3143 10.5118 1.0368 1.0368 1.0970 1.0971 1.1015 1.1014 1.0898 1.0928 1.0967 1.0642
irintensity: 0.6572 1.4360 1.6187 3.1251 1.3792 2.6931 1.0893 2.3031 2.0926 1.1502 1.1288 0.3498 4.0137 5.9265 1.1424 0.8115 16.1719 7.4339 10.9140 25.0475 10.3873 8.9950 5.0179 3.0660 12.3548 84.6225 56.8224 34.2308 9.5478 8.0460 33.2646 9.0684 47.1066 101.6659 90.7985 92.6119 44.4105 9.8209 69.8873 172.8723 126.7274 42.3942 10.7597 209.1665 74.8390 195.7504 598.5295 21.5874 73.9178 24.4522 139.0981 40.1572 85.8482 23.6563 68.9139 28.4124 9.8399 46.4822 0.6012 47.8946 14.3413 40.6593 272.6138 9.6727 299.8457 0.7421 0.6630 7.1903 2.7193 8.9193 8.9772 1.7075 2.9036 1.4012 53.9655
temp: 298.150 k
press: 1.00000 atm
elementType: 8 8 8 8 8 8 6 6 6 6 6 6 6 6 6 6 6 1 1 1 1 1 1 1 1 1 1
symmnumber: 1
zpe: 503028.6 jmol-1
zpe.correction: 0.191593 hartree
zpe.thermalcorrener: 0.208929 hartree
zpe.thermalcorrenthalpy: 0.209874 hartree
zpe.thermalcorrgfe: 0.143091 hartree
zpe.sumelectzpe: -875.291523 hartree
zpe.sumelectthermal: -875.274187 hartree
zpe.sumelectthermalent: -875.273243 hartree
zpe.sumelectthermalfe: -875.340026 hartree
dipole: -2.0331 -1.3459 -0.6636
dipole: 2.5269
quadrupole: -74.1987 -89.3688 -109.9792
quadrupole: -7.7474 -2.8635 7.1061
quadrupole: 16.9836 1.8134 -18.7970 -7.7474 -2.8635 7.1061
hfenergy: -875.4831162 hartree
pointgroup: C01 [X(C11H10O6)]
dipole: 0.8350485 0.444756 -0.3053387 debye
polarizability: 200.0041187|-5.1384002|127.6975343|-2.0476367|-18.6436578|98.3822281 unknown
InChI: InChI=1S/C11H10O6/c1-6(12)16-9-4-3-8(11(14)15)5-10(9)17-7(2)13/h3-5,14H,1-2H3
charge 0 multiplicity 1
27 atoms
O  0.989528 -1.304699 0.715122
O  1.819039 1.051364 -0.713345
O  -4.580431 0.996438 -0.282972
O  -4.168085 -1.011204 0.810383
O  1.534204 -2.069079 -1.441024
O  2.309401 1.473016 1.548753
C  0.033928 -0.379904 0.2102
C  0.4474 0.805195 -0.447462
C  -2.291893 0.307828 -0.030736
C  -1.32868 -0.626536 0.424776
C  -0.508188 1.729674 -0.911716
C  -1.87924 1.484082 -0.707295
C  -3.725366 0.00384 0.220888
C  1.716221 -2.117404 -0.214737
C  2.701413 1.348746 0.379279
C  2.668753 -3.001052 0.553358
C  4.10442 1.492698 -0.157699
H  -1.651821 -1.535709 0.940452
H  -0.161457 2.630556 -1.426073
H  -2.632587 2.192607 -1.059606
H  3.304446 -2.39179 1.218115
H  3.289696 -3.577031 -0.147285
H  2.098101 -3.693065 1.197237
H  4.40573 0.571068 -0.684766
H  4.799214 1.701823 0.667911
H  4.142576 2.313155 -0.895052
H  -5.520625 0.738784 -0.086205
