program: Gaussian 09
title: 000094115
version: EM64L-G09RevD.01
frameworkgroup: C1[X(C20H23ClO)]
method: RPBEPBE
basis: SDD
operation: Freq
keyword: #p
keyword: freq=noraman
keyword: PBEPBE/SDD
title: #p freq=noraman PBEPBE/SDD
converged: YES YES NO NO
title: Mulliken charges:
elementType: Cl O C C C C C C C C C C C C C C C C C C C C H H H H H H H H H H H H H H H H H H H H H H H
charge: -0.120050 -0.114517 -0.361734 -0.375964 -0.388299 -0.352308 -0.573769 -0.356072 0.509428 -0.422936 -0.426304 -0.695455 0.341778 -0.389426 -0.389160 0.364231 -0.384505 -0.387168 -0.379639 -0.311141 0.414895 -0.188484 0.193990 0.191460 0.211597 0.211123 0.191263 0.192884 0.188873 0.187893 0.210891 0.209225 0.195671 0.195338 0.236504 0.236743 0.209802 0.209906 0.216472 0.235366 0.236215 0.246589 0.245589 0.269026 0.264178
chargesum: 0.00000
title: Mulliken charges with hydrogens summed into heavy atoms:
elementType: Cl O C C C C C C C C C C C C C C C C C C C C
charge: -0.120050 -0.114517 0.023716 0.008183 0.034421 0.024458 -0.153653 0.034937 0.509428 -0.186431 -0.189561 -0.059275 0.341778 -0.154060 -0.152945 0.364231 -0.137916 -0.141579 -0.110613 -0.046962 0.414895 -0.188484
polarizability: 4.40184524e+02 -3.36397444e+01 1.88797294e+02 2.61662830e+01 3.12940780e+01 1.62732805e+02
1716.lowfreq: -3.5548 0.0003 0.0004 0.0012 2.9797 8.3918 12.9978 16.3208 29.7523
frequency: 12.8532 16.0784 29.6733 39.8127 48.3726 54.0833 71.9753 78.0245 90.1153 96.5088 125.2527 129.5524 140.9963 169.0735 190.2052 219.9207 235.3537 246.4999 290.4442 309.3166 343.5956 365.2279 387.4847 404.1369 408.3206 416.5189 425.6970 461.2114 501.9606 513.9041 559.3227 615.9901 628.9747 631.8769 641.6903 708.4776 721.4677 730.9684 735.9342 755.3015 760.5230 808.6987 822.1731 840.9082 842.7363 849.2493 854.4027 870.7867 889.7683 905.3692 960.5176 974.7404 984.2925 988.1231 989.9216 990.4910 994.7104 1011.7145 1026.0447 1026.4452 1038.9627 1072.0031 1072.7883 1079.7674 1116.5043 1132.0915 1134.5688 1186.8878 1189.8873 1196.0900 1217.3102 1219.8741 1227.6331 1231.4857 1265.8540 1267.0116 1277.8078 1289.2085 1292.4831 1296.4947 1306.7494 1306.9642 1312.8451 1333.1283 1350.2532 1350.4693 1354.2147 1378.3237 1390.0624 1416.1593 1425.1112 1461.2214 1461.7340 1465.8765 1471.3319 1478.2121 1478.6113 1483.7606 1485.1985 1488.4609 1521.2901 1551.6584 1575.4022 1609.2362 1622.5759 1707.3761 2951.0644 2951.7247 2958.7042 2967.5190 2969.6814 2972.4254 2979.8295 2985.6546 2995.2468 3010.3646 3022.0819 3035.5729 3049.7618 3068.9888 3071.4828 3119.0949 3120.7893 3141.4948 3144.4703 3148.0940 3150.8407 3165.0974 3176.7139
redmass: 5.4082 5.0969 1.8643 5.7928 5.1199 3.1197 3.5747 3.7724 1.9774 4.6739 2.6184 4.1640 1.9797 5.7515 4.7739 5.1426 1.1123 6.0041 4.0948 3.5362 5.3179 3.7326 8.3795 2.8705 2.8952 3.6080 4.7734 3.2853 3.5931 6.1445 2.8012 6.0617 4.3346 5.9239 6.6354 5.6574 1.0629 1.0910 3.8195 3.7218 1.1523 3.5326 1.2215 1.7308 2.0944 1.4495 1.8011 1.7789 1.8683 1.2439 1.4072 1.3814 1.3484 4.1822 1.1939 1.4342 5.6993 2.9376 2.4518 3.1640 3.3205 1.7769 1.6901 2.1986 2.4878 1.3066 1.3839 1.7327 1.5067 1.1766 1.6688 1.6431 1.4107 1.9710 1.2597 1.3652 1.0410 1.1168 1.1103 3.0366 1.3904 1.3798 1.3258 1.4242 2.3377 1.6062 1.6705 7.4040 1.2170 3.2598 4.2589 1.0759 1.0734 1.0749 1.0829 1.0523 1.0709 2.2511 1.0997 1.0952 2.9542 6.1072 7.0154 6.0929 6.4252 12.7977 1.0589 1.0589 1.0591 1.0590 1.0585 1.0366 1.0592 1.0969 1.0995 1.1018 1.1033 1.1046 1.1048 1.1007 1.0993 1.0876 1.0877 1.0921 1.0913 1.0924 1.0925 1.0965 1.0957
irintensity: 0.1518 0.2709 0.0569 0.0722 0.4242 0.1188 0.4929 0.7104 0.0772 0.6569 0.2699 0.7518 0.0158 0.6102 1.1762 0.2307 0.0023 5.7863 0.2911 1.7423 23.4535 0.0988 3.9965 0.5354 1.3981 5.1141 3.6576 3.6852 11.2797 10.3895 12.9147 35.9608 16.2031 12.0416 0.6070 69.7696 13.1225 0.0459 13.2388 4.7489 2.4617 51.6116 0.7722 75.3392 82.7705 41.9119 77.1541 18.5468 7.0377 0.8148 0.4120 1.5826 1.0764 1.8913 0.5267 0.5450 7.8479 4.0545 0.7707 3.1076 1.9620 1.1786 1.6886 0.7116 30.5240 2.8115 13.0396 0.0050 240.4343 53.8137 54.1453 12.0539 0.3181 55.1139 0.1412 1.5966 0.6929 0.0638 0.1018 31.1416 1.4059 1.0554 1.9732 2.1745 5.3178 1.0890 0.5160 1.2533 11.4167 3.6548 17.0380 0.0222 0.0780 1.1231 0.2086 9.8311 5.4560 20.6994 1.4094 29.9679 9.0464 21.1807 8.1579 403.6367 1.5546 402.1028 3.3863 0.3460 22.8918 29.1166 75.9437 39.4708 97.4191 0.4263 0.5760 0.2613 0.9474 43.4239 107.0113 93.7610 54.1289 4.8860 34.0470 8.8439 14.7637 6.6962 5.3723 6.8895 2.1953
temp: 298.150 k
press: 1.00000 atm
elementType: 17 8 6 6 6 6 6 6 6 6 6 6 6 6 6 6 6 6 6 6 6 6 1 1 1 1 1 1 1 1 1 1 1 1 1 1 1 1 1 1 1 1 1 1 1
symmnumber: 1
zpe: 979092.2 jmol-1
zpe.correction: 0.372917 hartree
zpe.thermalcorrener: 0.395380 hartree
zpe.thermalcorrenthalpy: 0.396324 hartree
zpe.thermalcorrgfe: 0.316421 hartree
zpe.sumelectzpe: -1309.627105 hartree
zpe.sumelectthermal: -1309.604642 hartree
zpe.sumelectthermalent: -1309.603698 hartree
zpe.sumelectthermalfe: -1309.683600 hartree
dipole: 7.2356 -1.0148 0.8368
dipole: 7.3541
quadrupole: -190.2133 -136.8384 -136.2726
quadrupole: 3.6162 -4.1927 6.5944
quadrupole: -35.7719 17.6030 18.1689 3.6162 -4.1927 6.5944
hfenergy: -1310.0000217 hartree
pointgroup: C01 [X(C20H23Cl1O1)]
dipole: 2.8353033 -0.4851808 0.3115571 debye
polarizability: 438.2545967|-41.0677827|189.4476668|25.4422035|31.2630007|164.012359 unknown
InChI: InChI=1S/C20H23ClO/c1-2-3-4-5-6-7-16-8-10-17(11-9-16)18-12-14-19(15-13-18)20(21)22/h8-15H,2-7H2,1H3
charge 0 multiplicity 1
45 atoms
Cl -7.615126 2.223392 0.151419
O  -7.707491 -0.177237 -1.142401
C  5.415164 -0.467547 0.345731
C  6.296068 0.600964 -0.340554
C  3.902473 -0.194271 0.195635
C  7.810023 0.317133 -0.21421
C  3.024311 -1.284127 0.875464
C  8.691615 1.380203 -0.908838
C  1.537581 -1.030218 0.694214
C  0.848226 -1.515223 -0.448004
C  0.800703 -0.263943 1.634754
C  10.202106 1.085207 -0.784752
C  -1.258306 -0.475482 0.296545
C  -0.520305 -1.247394 -0.643958
C  -0.567281 0.011413 1.441338
C  -2.70324 -0.192081 0.091546
C  -3.543369 -1.111842 -0.603497
C  -3.294872 1.008257 0.581325
C  -4.905916 -0.845219 -0.801319
C  -4.658931 1.28402 0.390676
C  -5.483466 0.360905 -0.304685
C  -6.923232 0.567038 -0.553142
H  5.675454 -0.522084 1.423667
H  5.650623 -1.465131 -0.081227
H  3.654531 0.79531 0.629839
H  3.639447 -0.136983 -0.879971
H  6.024384 0.663658 -1.415133
H  6.07211 1.597246 0.094704
H  8.086064 0.258886 0.859621
H  8.033429 -0.680798 -0.646611
H  3.276731 -1.320409 1.953352
H  3.295189 -2.269607 0.447906
H  8.471419 2.376712 -0.474251
H  8.412153 1.440385 -1.980642
H  1.394347 -2.107256 -1.192609
H  1.30426 0.108791 2.535122
H  10.453543 0.107954 -1.23868
H  10.513655 1.05125 0.276403
H  10.809365 1.858503 -1.29023
H  -1.01327 -1.614033 -1.551334
H  -1.113193 0.575855 2.205676
H  -3.12769 -2.058739 -0.963111
H  -2.669484 1.74894 1.089963
H  -5.544486 -1.561483 -1.328532
H  -5.093614 2.214584 0.765691
