program: Gaussian 09
title: 000094101
version: EM64L-G09RevD.01
frameworkgroup: C1[X(C10H20O2S)]
method: RPBEPBE
basis: SDD
operation: Freq
keyword: #p
keyword: freq=noraman
keyword: PBEPBE/SDD
title: #p freq=noraman PBEPBE/SDD
converged: NO YES NO NO
title: Mulliken charges:
elementType: S O O C C C C C C C C C C H H H H H H H H H H H H H H H H H H H H
charge: 0.165667 -0.427268 -0.224522 0.302684 -0.358947 -0.107533 -0.724821 -0.730833 -0.705529 -0.672234 -0.709919 -0.718281 0.270186 0.250338 0.189899 0.210693 0.207254 0.215981 0.233211 0.203517 0.208849 0.196669 0.222929 0.215339 0.237450 0.217727 0.212807 0.233197 0.221002 0.231037 0.264722 0.288425 0.380307
chargesum: 0.00000
title: Mulliken charges with hydrogens summed into heavy atoms:
elementType: S O O C C C C C C C C C C
charge: 0.165667 -0.046961 -0.224522 0.302684 0.081290 -0.107533 -0.090892 -0.085257 -0.070592 -0.004251 -0.024683 -0.165135 0.270186
polarizability: 1.52933256e+02 -6.82755634e+00 1.33592583e+02 -5.74608788e+00 -2.08183920e-01 1.14064092e+02
1716.lowfreq: -18.7232 -12.0904 -0.0005 0.0013 0.0014 11.2674 26.1817 39.8498 63.7769
frequency: 25.7158 39.4789 63.7213 74.9711 109.9723 155.3040 168.9797 180.5996 210.0197 230.0065 236.7412 250.8169 267.1737 282.0166 300.3171 310.5884 322.8952 354.1102 372.7748 380.3771 383.7063 411.5050 440.1757 503.3723 515.3184 554.7278 571.6274 641.9944 732.2935 735.4403 801.5632 821.8796 855.5131 880.2223 902.8139 927.1427 927.4989 934.9492 943.6774 985.5741 1002.4519 1024.0084 1033.1344 1045.0050 1105.5841 1147.3440 1165.6492 1201.5949 1209.2200 1227.1541 1233.6636 1253.7781 1302.7006 1319.5008 1354.5783 1371.5026 1376.9150 1381.8921 1395.2438 1407.8175 1423.5308 1446.5961 1455.9283 1459.1103 1462.1417 1463.6793 1471.4813 1475.4512 1479.8315 1485.0823 1496.6921 1501.3880 1664.6487 2938.9871 2965.1174 2968.5435 2971.2293 2979.1760 2985.7295 3016.0270 3054.0346 3055.4051 3061.3804 3062.4913 3067.9609 3073.4843 3076.8123 3088.7260 3089.0423 3092.1936 3099.0850 3144.2041 3510.5824
redmass: 5.7792 4.9197 3.2505 5.0416 3.7730 2.4083 4.6590 2.2026 1.4207 1.9571 1.4974 1.3504 1.1031 1.6704 1.9810 1.2377 2.4097 2.2613 2.4483 2.4864 2.6655 1.8579 2.3693 2.8242 3.9431 2.9251 2.2630 1.9194 3.8739 5.5943 3.0577 4.0096 1.8252 2.1920 2.1605 1.7391 1.5853 1.4117 1.2078 1.6949 1.3383 1.4167 1.4099 1.7550 1.5664 2.5364 1.2541 1.9911 2.5233 1.2499 3.2113 3.1695 2.1868 1.4509 1.3191 1.1936 1.2015 1.2024 1.1964 1.2091 1.1099 1.0723 1.0554 1.0516 1.0472 1.0495 1.0552 1.0523 1.0510 1.0621 1.0579 1.0538 8.5034 1.0644 1.0348 1.0365 1.0370 1.0384 1.0359 1.0943 1.0978 1.0989 1.0982 1.0576 1.0985 1.0977 1.0997 1.0987 1.0981 1.0985 1.0978 1.1075 1.0639
irintensity: 1.3652 0.3417 0.1289 0.1937 0.3811 0.8847 0.2380 0.3195 0.1343 0.5926 0.1854 0.2683 0.0311 0.1099 0.0549 0.2906 1.7854 0.0960 1.8345 1.0764 2.7516 0.4935 1.8422 10.5590 31.4021 3.7115 55.0268 127.2632 1.6644 10.0653 0.8048 22.3129 3.8518 0.4551 2.3522 2.3762 1.1764 1.2753 0.0469 7.9396 0.3047 0.1173 0.5347 169.3984 34.4545 11.6028 34.6267 53.5200 2.2392 5.1971 10.3250 20.5984 41.2326 1.8685 16.2069 7.7688 27.1539 25.8560 15.9050 11.9048 22.1319 2.5005 2.1908 7.5275 1.3924 5.0584 6.8425 12.9660 4.6295 7.9014 25.6694 19.4081 290.5579 29.0449 31.5829 32.8807 44.6986 26.0541 23.7643 5.3793 33.8947 9.7246 50.6254 10.3140 9.5703 83.6365 44.0254 43.5392 0.8012 51.0735 19.9530 1.0432 23.2937
temp: 298.150 k
press: 1.00000 atm
elementType: 16 8 8 6 6 6 6 6 6 6 6 6 6 1 1 1 1 1 1 1 1 1 1 1 1 1 1 1 1 1 1 1 1
symmnumber: 1
zpe: 741398.1 jmol-1
zpe.correction: 0.282384 hartree
zpe.thermalcorrener: 0.299302 hartree
zpe.thermalcorrenthalpy: 0.300246 hartree
zpe.thermalcorrgfe: 0.238198 hartree
zpe.sumelectzpe: -940.496306 hartree
zpe.sumelectthermal: -940.479388 hartree
zpe.sumelectthermalent: -940.478444 hartree
zpe.sumelectthermalfe: -940.540491 hartree
dipole: -2.2445 0.3009 2.5361
dipole: 3.4000
quadrupole: -96.2583 -83.7482 -92.1953
quadrupole: -0.1093 6.9735 0.7611
quadrupole: -5.5243 6.9857 -1.4614 -0.1093 6.9735 0.7611
hfenergy: -940.7786897 hartree
pointgroup: C01 [X(C10H20O2S1)]
dipole: -0.9006897 -0.0471846 -0.9878818 debye
polarizability: 152.9471747|6.6452573|133.6906121|5.5700325|1.4230727|113.9521437 unknown
InChI: InChI=1S/C10H20O2S/c1-9(2,3)7-10(4,5)13-6-8(11)12/h11H,6-7H2,1-5H3
charge 0 multiplicity 1
33 atoms
S  0.959462 -1.389374 0.721525
O  1.852971 1.699144 -0.727271
O  3.541247 1.058914 0.734817
C  -1.896466 0.979475 0.179567
C  -1.17016 -0.03601 -0.772315
C  -0.688391 -1.451163 -0.335452
C  -1.943934 2.325681 -0.604127
C  -3.365479 0.558718 0.471093
C  -1.152087 1.226437 1.517265
C  -0.415225 -2.294283 -1.604587
C  -1.632728 -2.238329 0.601221
C  2.25719 -0.668219 -0.471281
C  2.643721 0.735039 -0.072159
H  -0.289957 0.483735 -1.199316
H  -1.861825 -0.203757 -1.628041
H  -2.473337 3.100149 -0.017798
H  -2.474767 2.208934 -1.568831
H  -0.922528 2.691162 -0.819325
H  -3.431075 -0.339867 1.106463
H  -3.914756 0.355559 -0.468776
H  -3.893681 1.375791 0.998798
H  -1.674992 2.01439 2.093791
H  -0.113646 1.557586 1.341397
H  -1.101364 0.321228 2.146131
H  0.055324 -3.258986 -1.347345
H  -1.371261 -2.498174 -2.12554
H  0.237152 -1.765239 -2.32383
H  -1.238831 -3.255792 0.776085
H  -2.628339 -2.330442 0.129488
H  -1.75926 -1.745669 1.579309
H  1.851892 -0.69563 -1.492876
H  3.139477 -1.319576 -0.39241
H  2.119953 2.604368 -0.40907
