program: Gaussian 09
title: 000094036
version: EM64L-G09RevD.01
frameworkgroup: C1[X(C8H9NO)]
method: RPBEPBE
basis: SDD
operation: Freq
keyword: #pfreq=noraman
keyword: PBEPBE/SDD
title: #p freq=noraman PBEPBE/SDD
converged: YES YES NO NO
title: Mulliken charges:
elementType: O N C C C C C C C C H H H H H H H H H
charge: -0.446986 -0.045100 0.008248 0.424028 -0.477618 -0.298831 -0.202096 -0.174623 -0.366237 -0.679742 0.223250 0.207450 0.295369 0.237566 0.231040 0.239301 0.215678 0.266864 0.342439
chargesum: 0.00000
title: Mulliken charges with hydrogens summed into heavy atoms:
elementType: O N C C C C C C C C
charge: -0.104547 -0.045100 0.008248 0.424028 -0.046918 -0.003462 0.035470 0.056417 -0.126936 -0.197200
polarizability: 1.29076031e+02 -1.40281415e+01 1.08693752e+02 2.02097054e+00 4.68085204e+00 4.86547709e+01
1716.lowfreq: -4.5123 0.0006 0.0007 0.0007 7.4597 13.6970 54.3481 116.3780 138.6500
frequency: 54.3275 116.3621 138.6499 190.8422 256.9167 329.3544 373.8306 396.9746 410.7262 504.8762 517.0770 617.9526 634.4443 701.5246 744.6310 753.2755 811.4884 901.0223 907.7744 953.3826 958.1784 962.4270 980.1770 990.5499 1001.4574 1041.6596 1088.1205 1132.6904 1165.9723 1174.1139 1280.4558 1297.7791 1312.3379 1337.6920 1369.7959 1399.8130 1415.3305 1459.2148 1471.7379 1556.6286 1577.3710 1636.9272 2983.8327 3061.7669 3098.6406 3122.4206 3140.6590 3164.3048 3176.6971 3214.7948 3563.2781
redmass: 4.2036 3.3389 4.1489 3.4906 3.5996 1.5634 1.9088 3.1372 3.7103 2.9033 3.5995 6.9328 3.9539 1.3421 2.4363 1.9774 2.1806 1.6939 1.8590 1.7608 1.5163 4.5541 2.4181 1.4303 1.3460 2.5866 1.6657 1.9979 1.2775 1.0976 1.6023 1.4715 4.7335 2.4273 1.2082 1.4453 1.4551 2.3752 1.0911 5.0386 5.6067 5.6122 1.0642 1.0997 1.0616 1.0889 1.0895 1.0960 1.0991 1.1142 1.0663
irintensity: 2.1278 5.3538 2.6929 5.1535 5.0686 82.8663 86.8119 6.6733 5.9442 21.1944 3.5331 1.3776 1.9316 1.0349 13.2179 31.4992 38.1720 22.2430 38.8438 49.2599 2.1306 11.0581 5.1649 52.8632 1.0098 4.7410 3.4048 10.8869 16.1691 1.2514 1.8924 13.2335 1.8914 9.3460 15.5338 21.2942 16.2606 41.8027 13.2877 16.0841 41.5812 1.5086 59.8715 22.7400 9.6766 16.9796 15.0194 20.3232 9.9067 5.2017 5.6021
temp: 298.150 k
press: 1.00000 atm
elementType: 8 7 6 6 6 6 6 6 6 6 1 1 1 1 1 1 1 1 1
symmnumber: 1
zpe: 397472.8 jmol-1
zpe.correction: 0.151389 hartree
zpe.thermalcorrener: 0.160455 hartree
zpe.thermalcorrenthalpy: 0.161400 hartree
zpe.thermalcorrgfe: 0.116994 hartree
zpe.sumelectzpe: -439.458705 hartree
zpe.sumelectthermal: -439.449639 hartree
zpe.sumelectthermalent: -439.448695 hartree
zpe.sumelectthermalfe: -439.493101 hartree
dipole: 0.4805 -0.2995 0.2343
dipole: 0.6127
quadrupole: -49.2546 -61.3704 -59.3267
quadrupole: -6.6810 -0.7256 1.0623
quadrupole: 7.3960 -4.7199 -2.6762 -6.6810 -0.7256 1.0623
hfenergy: -439.6100949 hartree
pointgroup: C01 [X(C8H9N1O1)]
dipole: -0.1957705 0.1028207 0.0959707 debye
dipolederiv: -0.6887512 -0.2294496 0.0398522 -0.2147813 -0.5350933 -0.2518225 -0.0031565 -0.3083946 -0.4523773 -0.5083446 -0.0011345 0.0149675 -0.0537844 -0.293127 0.0029021 0.0262087 0.0041108 -0.2319591 0.5716284 -0.1256631 0.0006248 -0.3339023 0.1108457 0.0226828 0.0134548 0.0195545 0.0454165 0.0968613 -0.0499399 -0.0107409 0.1277868 -0.0448306 -0.0921976 -0.0196676 -0.0140323 -0.1304492 0.3504161 0.1388948 -0.0109768 0.0744426 0.4130631 0.1702201 -0.0156742 0.1811154 0.5083629 -0.293497 0.12115 0.0045238 0.3095685 -0.126295 -0.0034151 0.027193 0.0192407 -0.1140922 0.2065742 -0.0788344 -0.0108242 -0.0561392 0.2007771 -0.0212265 -0.033363 -0.0121616 -0.1268631 -0.0368797 0.0310416 -0.0063383 -0.2101414 -0.2081971 0.0148927 0.0172853 0.0136071 -0.1258298 0.1604434 0.0510244 -0.022232 0.2883362 0.2841564 -0.0397374 -0.0451543 -0.0360187 -0.0646718 -0.1410857 0.0640514 -0.058344 0.0009667 -0.1008948 -0.0501352 -0.0523124 -0.0419905 -0.3334328 0.0949373 0.0258503 -0.0850969 -0.0046175 -0.0298844 0.0928632 -0.0481281 0.0369767 -0.066775 -0.1698047 0.0484019 0.0700728 0.1236367 -0.011999 -0.0845705 0.0039989 -0.0416688 0.0330228 0.1060378 -0.0616704 0.0188254 -0.0766575 0.0377144 0.0135701 0.0278224 0.0021037 0.1579851 0.0589456 0.0664113 -0.0012071 0.0843008 -0.0815028 0.0109803 -0.0019003 0.0073037 0.1451564 -0.1205107 0.0224075 0.0128816 0.0300446 0.0973166 0.002507 0.015178 0.0045711 0.1659187 -0.0343759 -0.0881946 0.016383 -0.1290111 -0.0353045 0.0200814 0.0191262 0.0139568 0.1270047 -0.1250815 0.0573515 0.0229471 0.0088811 0.0978007 0.0113338 0.0401813 0.0006289 0.1610772 0.0881405 -0.0744467 0.0297585 -0.076527 0.03828 0.0319224 0.0343318 0.0384625 0.1836208 0.3843464 0.0827485 -0.0250765 0.1075977 0.1871744 0.149149 -0.005424 0.1126346 0.118885 unknown
polarizability: 130.8358656|-12.5170945|107.0718211|-2.6450524|-3.4766583|48.5168679 unknown
InChI: InChI=1S/C8H9NO/c1-7(6-10)8-4-2-3-5-9-8/h2-5,10H,1,6H2
charge 0 multiplicity 1
19 atoms
O  2.448522 1.658779 0.512266
N  -0.859016 -1.312127 0.033634
C  -0.00846 -0.237124 -0.102349
C  1.452956 -0.536573 -0.199593
C  2.414819 0.597383 -0.521157
C  -0.501053 1.096861 -0.158704
C  -1.893754 1.321572 -0.101812
C  -2.766379 0.218082 0.023437
C  -2.195635 -1.076107 0.094908
C  1.925666 -1.805152 -0.03399
H  2.110387 1.136426 -1.435369
H  3.430939 0.185136 -0.682056
H  0.20062 1.933197 -0.213887
H  -2.288695 2.342277 -0.144873
H  -3.85207 0.348098 0.070937
H  -2.831978 -1.962605 0.204073
H  2.995207 -2.031632 -0.117746
H  1.234279 -2.62676 0.176571
H  2.616945 1.235069 1.39191
