program: Gaussian 09
title: 000094093
version: EM64L-G09RevD.01
frameworkgroup: C1[X(C21H13NO4)]
method: RPBEPBE
basis: SDD
operation: Freq
keyword: #p
keyword: freq=noraman
keyword: PBEPBE/SDD
title: #p freq=noraman PBEPBE/SDD
converged: YES YES NO NO
title: Mulliken charges:
elementType: O O O O N C C C C C C C C C C C C C C C C C C C C C H H H H H H H H H H H H H
charge: -0.216782 -0.219125 -0.430189 -0.299300 -0.463288 -0.466768 0.409212 0.521672 0.042276 0.072618 0.054054 -0.569007 0.434266 0.315220 -0.420440 0.111770 -0.454431 0.168996 -0.366684 -0.234926 -0.434348 -0.417607 -0.229188 -0.339086 -0.228052 0.122379 0.264719 0.389464 0.266520 0.247403 0.245781 0.276758 0.233673 0.245714 0.246468 0.237240 0.268519 0.229576 0.384924
chargesum: 0.00000
title: Mulliken charges with hydrogens summed into heavy atoms:
elementType: O O O O N C C C C C C C C C C C C C C C C C C C C C
charge: -0.216782 -0.219125 -0.045265 -0.299300 -0.073824 -0.202049 0.409212 0.521672 0.042276 0.072618 0.054054 -0.302487 0.434266 0.315220 -0.173037 0.111770 -0.208650 0.168996 -0.089927 -0.001253 -0.188634 -0.171139 0.008051 -0.070566 0.001524 0.122379
polarizability: 2.95196880e+02 4.40270499e+01 2.50197674e+02 -6.59926172e+00 -1.47515177e+01 2.16895513e+02
1716.lowfreq: -10.0047 -5.5511 0.0002 0.0008 0.0009 3.9062 12.5124 19.4886 34.3187
frequency: 12.1331 19.2889 34.3013 68.7254 81.5878 110.0465 126.9931 141.4375 164.8217 204.8807 217.1014 231.2290 259.8504 265.3635 300.3251 339.4342 354.5839 383.5981 403.1216 428.2356 443.0683 449.2149 466.0447 471.1463 504.9334 522.8222 545.4360 559.8436 572.0677 575.5870 598.1643 602.1962 617.1238 623.8016 657.2652 676.9834 704.1418 712.0688 716.8550 732.3239 759.5646 760.9188 783.2327 789.7502 793.9442 801.8291 809.6792 837.8102 852.4365 869.1444 875.4266 920.9214 932.1359 946.0818 953.5240 958.2242 971.2393 982.7959 987.1509 1002.1229 1032.2221 1042.6092 1058.0775 1073.6324 1076.7600 1123.3031 1146.8319 1172.7281 1180.6661 1184.7105 1197.2985 1219.5486 1230.1190 1246.5130 1252.6901 1274.5673 1312.3300 1313.4639 1322.5606 1357.0737 1380.2034 1387.9560 1401.9409 1412.4842 1421.4527 1440.8143 1461.0731 1464.5125 1478.3214 1519.0577 1549.1261 1586.6345 1589.9944 1593.3459 1614.7684 1627.7787 1630.2901 1639.9083 3065.4292 3127.7876 3131.3717 3136.2622 3137.1155 3152.7239 3156.9643 3163.0318 3170.2498 3177.9779 3218.2655 3517.9538 3532.5841
redmass: 6.6075 6.3457 6.6498 8.4224 10.0221 8.6927 6.0324 5.8189 4.2864 5.4041 6.6087 6.0360 4.7832 4.0843 7.2161 7.0553 6.5011 6.3448 7.7704 6.8917 5.4851 6.0358 3.3405 3.8742 4.9004 5.9072 5.8814 2.0038 7.0875 5.5623 3.4627 2.0236 4.5907 4.5449 4.8627 3.0311 3.3355 2.0248 5.5855 2.4970 1.8666 3.0115 1.7905 2.9530 2.5034 2.5337 2.9037 2.0042 2.4865 4.2370 7.0807 1.4287 1.4171 6.1988 1.8648 3.3661 4.9833 1.3507 1.3687 1.3921 3.2976 3.8200 2.0444 2.0634 1.8975 2.0810 1.3551 1.3113 1.2876 1.2202 1.4567 1.6990 1.9420 1.7512 2.1092 1.8634 2.5085 1.9245 1.7138 4.0305 3.0398 3.9962 5.4138 2.8276 2.2240 5.1007 2.6613 6.9102 3.3829 4.7207 6.6218 7.0207 6.2720 6.7005 6.2489 8.0554 8.2381 10.7618 1.0862 1.0873 1.0882 1.0913 1.0875 1.0918 1.0936 1.0989 1.0982 1.0965 1.0983 1.0813 1.0642
irintensity: 0.3631 0.4399 1.6201 1.0510 0.6583 0.1724 1.1883 0.5168 2.1085 2.6899 4.8693 1.3594 3.0698 0.8439 6.6618 12.4165 5.1892 3.2460 10.0602 1.8452 2.3917 1.4405 1.1814 1.5812 11.1620 5.2761 14.8007 52.1221 2.0373 21.5959 19.4638 61.6205 3.3039 9.5197 18.3364 3.3559 2.2445 15.6780 8.2540 19.9850 73.7328 0.8989 67.1506 11.3587 7.9278 21.3030 2.0076 66.1746 76.7329 0.9792 22.8953 0.6717 0.5392 71.8483 29.9243 95.6813 11.1016 1.0340 0.8328 2.1524 53.1331 86.1015 27.5106 377.5155 25.2031 74.7918 28.8747 31.3023 6.4138 18.8645 58.6606 50.4028 23.0842 25.0225 28.7999 2.6676 2.1106 79.3054 52.3634 97.4169 8.6355 55.0730 4.7889 5.4274 3.4358 6.9173 2.8590 7.5073 30.6885 17.0975 18.1595 60.1221 3.4620 20.1786 119.9144 68.8083 94.2855 216.4677 7.4395 2.4150 1.7313 11.9028 3.5612 11.4488 21.9852 25.2639 15.1674 8.6797 1.9212 80.5992 47.8572
temp: 298.150 k
press: 1.00000 atm
elementType: 8 8 8 8 7 6 6 6 6 6 6 6 6 6 6 6 6 6 6 6 6 6 6 6 6 6 1 1 1 1 1 1 1 1 1 1 1 1 1
symmnumber: 1
zpe: 754790.8 jmol-1
zpe.correction: 0.287485 hartree
zpe.thermalcorrener: 0.307013 hartree
zpe.thermalcorrenthalpy: 0.307958 hartree
zpe.thermalcorrgfe: 0.237534 hartree
zpe.sumelectzpe: -1161.981065 hartree
zpe.sumelectthermal: -1161.961536 hartree
zpe.sumelectthermalent: -1161.960592 hartree
zpe.sumelectthermalfe: -1162.031016 hartree
dipole: 0.0085 2.2057 5.3154
dipole: 5.7549
quadrupole: -131.6583 -132.7269 -156.0404
quadrupole: 12.2473 8.9066 -12.2276
quadrupole: 8.4836 7.4149 -15.8985 12.2473 8.9066 -12.2276
hfenergy: -1162.2685495 hartree
pointgroup: C01 [X(C21H13N1O4)]
dipole: -0.0072545 -0.325133 2.2406666 debye
polarizability: 296.6147694|40.4128851|252.9553587|17.1808754|7.4006766|212.7199383 unknown
InChI: InChI=1S/C21H13NO4/c23-20(24)15-9-3-6-12-10-16(22-18(12)15)19-13-7-1-4-11-5-2-8-14(17(11)13)21(25)26-19/h1-10,19,22-23H
charge 0 multiplicity 1
39 atoms
O  1.236324 -1.186304 -2.249319
O  2.000203 0.647531 -3.372584
O  -3.511654 3.050217 1.536136
O  -1.354413 2.284862 1.14619
N  -1.026892 -0.209675 -0.099432
C  0.772822 -1.806438 -0.948242
C  1.686209 -1.478359 0.223765
C  -0.661862 -1.428391 -0.702214
C  2.458459 -0.273859 0.187602
C  2.509514 0.535652 -1.00062
C  -2.407835 -0.131694 -0.031877
C  -1.820121 -2.139724 -1.022314
C  3.206191 0.133234 1.356558
C  -2.949722 -1.337365 -0.607276
C  1.705633 -2.284938 1.366307
C  1.896183 0.058342 -2.275231
C  3.193647 -0.709548 2.515008
C  -3.236124 0.899813 0.489674
C  3.23142 1.737401 -1.004616
C  2.468449 -1.903906 2.512371
C  3.932304 1.368369 1.314191
C  -4.357498 -1.496404 -0.657738
C  3.931711 2.161775 0.162265
C  -4.638288 0.706203 0.422466
C  -5.186493 -0.47394 -0.143472
C  -2.603942 2.095826 1.064454
H  0.800618 -2.883722 -1.180006
H  -0.420337 0.530542 0.266127
H  -1.849274 -3.111359 -1.512786
H  1.112145 -3.206314 1.394694
H  3.76042 -0.404627 3.402152
H  3.263223 2.325153 -1.927606
H  2.46864 -2.550167 3.396216
H  4.492371 1.683042 2.202598
H  -4.799895 -2.399385 -1.092769
H  4.486235 3.105514 0.144393
H  -5.293548 1.488368 0.816183
H  -6.274521 -0.590019 -0.181523
H  -3.000703 3.821797 1.900376
