program: Gaussian 09
title: 000097048
version: EM64L-G09RevD.01
frameworkgroup: C1[X(C5H10N2O3)]
method: RPBEPBE
basis: SDD
operation: Freq
keyword: #p
keyword: freq=noraman
keyword: PBEPBE/SDD
title: #p freq=noraman PBEPBE/SDD
converged: YES YES NO NO
title: Mulliken charges:
elementType: O O O N N C C C C C H H H H H H H H H H
charge: -0.286520 -0.404973 -0.260364 -0.365977 -0.525944 -0.375105 -0.468545 0.206388 -0.507883 0.214542 0.231762 0.266628 0.273020 0.256115 0.339395 0.242363 0.223666 0.271413 0.289199 0.380822
chargesum: 0.00000
title: Mulliken charges with hydrogens summed into heavy atoms:
elementType: O O O N N C C C C C
charge: -0.286520 -0.024151 -0.260364 -0.026583 0.034667 0.123285 0.060591 0.206388 -0.041855 0.214542
polarizability: 9.97619532e+01 2.01908562e+00 7.33109862e+01 -2.40496113e-01 -4.72891571e+00 5.86647248e+01
1716.lowfreq: -16.7900 -7.6266 -4.8430 -0.0004 0.0001 0.0004 23.0508 39.5559 61.3079
frequency: 22.8431 39.5044 61.2754 70.1207 108.8380 175.4712 199.7471 257.9203 303.4937 308.9539 441.6304 465.8092 505.5218 546.0888 611.7689 648.9369 659.0745 678.5423 747.8296 790.2504 843.5454 885.6686 904.7590 1003.1628 1045.6844 1054.8126 1096.4233 1127.9637 1155.0318 1192.0276 1215.7196 1247.6223 1279.5873 1313.3796 1342.2848 1354.5323 1371.2292 1426.9328 1441.5507 1462.0552 1488.5749 1619.3315 1651.0601 1663.0559 2977.8840 3004.5482 3008.0520 3040.5113 3065.3725 3084.8552 3437.6251 3510.0839 3523.8128 3552.8410
redmass: 3.2124 3.0181 7.2847 6.7642 2.4919 2.7642 1.8560 2.1504 5.0480 3.2010 3.5887 2.2283 2.5466 3.1198 2.2669 2.2818 1.6490 1.2277 1.8632 2.8880 3.2219 1.9155 2.4060 2.2473 2.6020 2.5756 2.7462 1.7536 2.0624 1.1890 1.6965 1.6312 1.3632 1.3246 1.2491 1.5943 1.5873 1.0947 1.0878 1.1372 1.7764 7.0968 7.4913 1.0808 1.0616 1.0654 1.0608 1.1005 1.0976 1.1006 1.0457 1.0640 1.0776 1.0951
irintensity: 1.2974 2.5795 5.3536 2.3535 0.9993 25.4588 44.1122 27.2723 1.1790 34.9426 2.7996 28.2390 25.7230 30.1309 33.9169 14.9444 152.3521 165.5504 213.0755 65.4096 16.5795 0.8924 12.9709 10.7107 74.5526 169.9229 78.7510 2.1211 20.8427 10.6851 16.5922 74.3686 15.6147 7.3569 1.7982 58.0674 39.7778 38.7188 9.9467 56.9133 185.4410 176.2992 190.2120 35.8567 31.2457 25.2518 21.5726 23.1447 13.1978 3.2506 1.2281 31.9722 48.6607 2.3889
temp: 298.150 k
press: 1.00000 atm
elementType: 8 8 8 7 7 6 6 6 6 6 1 1 1 1 1 1 1 1 1 1
symmnumber: 1
zpe: 418903.5 jmol-1
zpe.correction: 0.159552 hartree
zpe.thermalcorrener: 0.171039 hartree
zpe.thermalcorrenthalpy: 0.171983 hartree
zpe.thermalcorrgfe: 0.119915 hartree
zpe.sumelectzpe: -530.925703 hartree
zpe.sumelectthermal: -530.914216 hartree
zpe.sumelectthermalent: -530.913272 hartree
zpe.sumelectthermalfe: -530.965340 hartree
dipole: -3.6444 -0.5579 0.6214
dipole: 3.7389
quadrupole: -60.1168 -63.8677 -58.3679
quadrupole: 1.2634 4.3103 2.4225
quadrupole: 0.6673 -3.0836 2.4163 1.2634 4.3103 2.4225
hfenergy: -531.0852552 hartree
pointgroup: C01 [X(C5H10N2O3)]
dipole: -1.4409379 0.2128996 -0.2053441 debye
dipolederiv: -0.8043663 0.0206645 -0.0884662 0.3409777 -0.8255281 0.1888387 -0.2588896 0.1246811 -0.4408572 -1.1784155 0.0368086 0.4013666 0.129697 -0.2832153 -0.1493161 0.4252637 -0.1046724 -0.5965709 -0.738007 0.0961231 0.1436099 -0.1226162 -0.6872261 0.3338967 0.3147879 0.1953818 -0.62412 -1.3501386 0.0317991 -0.1085068 -0.1183125 -0.3810368 -0.0476402 -0.1544236 -0.0158046 -0.532827 -0.8299689 -0.2023822 -0.0320665 -0.2932369 -0.5061873 -0.0316805 -0.0859349 -0.0321626 -0.2121992 0.4290205 0.0834861 -0.0241119 0.3719362 0.2021942 0.1113968 -0.1109295 0.0440326 0.2852571 -0.1106638 0.1007568 0.0362823 0.1176503 -0.1636896 0.0596317 -0.0131279 0.1502842 -0.0198479 1.4050231 -0.0734841 0.3610234 -0.3232005 0.8309242 -0.2381878 0.5744782 -0.1955617 0.309674 0.5306814 0.0083229 -0.0243463 -0.1655787 0.0631659 0.0118891 -0.0418506 0.0082437 0.2195248 1.4315873 -0.2604107 -0.5262853 -0.1812316 0.8761849 -0.3611195 -0.6686868 -0.2910962 0.7749027 -0.057568 -0.0636182 -0.0739614 -0.0939674 0.0866679 -0.0033404 -0.0632245 -0.060699 -0.1159036 0.1027332 0.1003414 0.0099483 -0.0054331 0.00176 0.00524 0.033176 0.0489658 0.1006909 0.0936553 0.0307019 -0.0531556 0.0260829 0.0861138 -0.0475625 -0.0164354 -0.0380164 -0.0339894 -0.0660873 -0.0854247 0.0090698 -0.0720651 0.0034987 0.0041432 0.0376914 -0.0251108 0.1277568 0.3250048 -0.0278975 -0.0790505 -0.101393 0.1325441 0.0364316 -0.0549751 0.0336399 0.3110928 -0.0375889 0.0191042 0.0623356 0.0143116 0.0106601 -0.074101 0.0878517 -0.1048313 -0.0336459 0.0027202 0.0207405 -0.0677655 0.0079803 0.0230375 0.0806541 -0.0684221 0.1237576 -0.0606553 0.2274795 0.0698798 -0.0249558 0.1956092 0.1990206 -0.1367421 0.0150364 -0.0771248 0.0635676 0.2746891 0.0518885 0.0652687 0.1972785 0.1845454 0.1600528 0.0676615 0.0972013 0.1497599 0.35021 0.0426001 0.0137672 0.0755113 0.146566 0.0975155 -0.0190468 0.1188916 0.3283896 unknown
polarizability: 99.6429986|-2.7194094|72.0601709|-1.382415|-6.2186755|60.0344947 unknown
InChI: InChI=1S/C5H10N2O3/c6-3-4(8)7-2-1-5(9)10/h7,9H,1-3,6H2
charge 0 multiplicity 1
20 atoms
O  2.120515 -1.39906 0.340974
O  -3.680826 0.448553 0.846072
O  -2.149764 1.267232 -0.689632
N  0.415663 -0.097362 -0.575288
N  4.033887 0.718072 -0.001294
C  -0.589168 -1.168179 -0.58402
C  -1.740548 -0.913742 0.413044
C  1.701052 -0.283757 -0.099036
C  2.595867 0.986667 -0.10283
C  -2.49868 0.363415 0.108256
H  -0.998451 -1.283408 -1.605133
H  -0.063682 -2.099111 -0.311378
H  -1.344233 -0.840711 1.444076
H  -2.455218 -1.757234 0.412961
H  0.108813 0.820203 -0.910241
H  2.286713 1.6137 0.75748
H  2.398178 1.585218 -1.012268
H  4.41759 0.300287 -0.857223
H  4.247777 0.112523 0.801092
H  -4.142286 1.307496 0.641988
