program: Gaussian 09
title: 000097035
version: EM64L-G09RevD.01
frameworkgroup: C1[X(C14H11NO)]
method: RPBEPBE
basis: SDD
operation: Freq
keyword: #p
keyword: freq=noraman
keyword: PBEPBE/SDD
title: #p freq=noraman PBEPBE/SDD
converged: NO NO NO NO
title: Mulliken charges:
elementType: O N C C C C C C C C C C C C C C H H H H H H H H H H H
charge: -0.248226 -0.263115 -0.504404 0.343923 0.060397 0.064848 0.439119 -0.388898 -0.357950 -0.218582 -0.343926 -0.348355 -0.222770 -0.227078 -0.243343 -0.248464 0.251405 0.251378 0.242986 0.269387 0.230916 0.307538 0.239977 0.234141 0.226875 0.223315 0.228904
chargesum: 0.00000
title: Mulliken charges with hydrogens summed into heavy atoms:
elementType: O N C C C C C C C C C C C C C C
charge: -0.248226 -0.263115 -0.001621 0.343923 0.060397 0.064848 0.439119 -0.145911 -0.088563 0.012334 -0.036388 -0.108378 0.011371 -0.000203 -0.020028 -0.019560
polarizability: 2.66124392e+02 -3.87250700e+00 1.64139890e+02 4.35997254e-03 -1.46315623e-02 6.40672871e+01
1716.lowfreq: -0.0005 -0.0004 0.0006 7.7502 10.0173 18.1170 49.8231 64.4867 132.1016
frequency: 49.7507 64.4585 132.1016 145.3709 168.2666 256.2194 284.6953 295.4284 301.8308 339.0752 409.2011 416.8304 485.6107 519.4382 520.2864 567.4246 613.8252 618.8961 662.3840 672.7514 696.6611 733.2449 740.3184 765.9459 792.3539 808.6326 839.5084 864.6778 886.3544 915.6086 961.9491 973.5876 983.4414 1000.2603 1002.6062 1006.0593 1012.1452 1025.5304 1054.1202 1083.2940 1092.1881 1133.6886 1169.1230 1174.9693 1178.6403 1191.8521 1201.9591 1225.2056 1276.1609 1295.4774 1332.5778 1353.5920 1381.1377 1406.8957 1447.1054 1452.7221 1459.3444 1471.2536 1491.7110 1583.2584 1608.3085 1613.3075 1623.9228 1630.0752 2971.7212 3018.7687 3125.0911 3126.3495 3135.0671 3138.4318 3152.0415 3152.2766 3164.6568 3166.5579 3187.1935
redmass: 5.0024 4.1299 4.8605 5.7296 4.4143 2.5369 7.3797 6.1705 4.7424 6.1239 2.9489 3.0170 3.3435 6.0345 3.0134 6.6711 6.3177 6.5055 6.3076 4.6806 1.9583 6.5532 1.8246 1.7123 2.1050 5.1774 1.2630 5.6884 1.3076 1.4121 1.4172 1.3492 6.0354 1.3310 1.3317 1.7352 2.5927 2.6642 2.5466 2.0758 1.9807 3.3865 1.1055 1.0527 1.0790 2.2855 1.1501 2.1152 1.9862 1.9882 1.4492 2.3501 7.0150 6.7180 2.3586 2.2612 1.7741 1.5394 2.2968 6.1595 7.2167 6.0278 7.8855 10.5036 1.0582 1.1037 1.0848 1.0868 1.0896 1.0900 1.0933 1.0947 1.0994 1.1002 1.0952
irintensity: 1.3424 0.0340 0.7378 1.9566 0.2297 6.2118 3.3644 4.1440 0.2046 1.5917 0.0012 3.2356 11.2821 3.4595 10.5269 1.5464 1.5523 10.7999 1.4571 6.8947 34.7136 4.5467 43.1244 104.2555 23.5626 0.1029 0.3848 11.4965 0.5118 9.8968 2.1395 0.2050 0.3272 0.0721 3.7203 0.2032 9.5415 1.7366 28.0925 13.0299 48.9615 32.0408 4.5484 1.3345 0.4072 27.1516 0.9047 25.0426 0.8941 89.0974 24.6668 184.1830 0.5310 5.5047 12.3475 2.9273 41.2991 16.4824 140.9984 0.8768 2.0128 78.4407 57.2135 180.3228 21.4983 11.9890 3.1041 0.9996 15.0784 10.4316 40.6156 12.9859 17.2677 25.9549 11.4771
temp: 298.150 k
press: 1.00000 atm
elementType: 8 7 6 6 6 6 6 6 6 6 6 6 6 6 6 6 1 1 1 1 1 1 1 1 1 1 1
symmnumber: 1
zpe: 555083.9 jmol-1
zpe.correction: 0.211420 hartree
zpe.thermalcorrener: 0.223354 hartree
zpe.thermalcorrenthalpy: 0.224298 hartree
zpe.thermalcorrgfe: 0.172918 hartree
zpe.sumelectzpe: -668.993229 hartree
zpe.sumelectthermal: -668.981295 hartree
zpe.sumelectthermalent: -668.980351 hartree
zpe.sumelectthermalfe: -669.031731 hartree
dipole: -1.5963 -4.0799 0.0019
dipole: 4.3810
quadrupole: -75.0660 -88.4265 -98.3718
quadrupole: 0.6959 -0.0012 0.0029
quadrupole: 12.2221 -1.1384 -11.0837 0.6959 -0.0012 0.0029
hfenergy: -669.2046488 hartree
pointgroup: C01 [X(C14H11N1O1)]
dipole: 0.6254966 -1.6061348 -0.000755 debye
polarizability: 266.1363741|3.7113568|164.1279079|0.0043831|0.0146247|64.0672871 unknown
InChI: InChI=1S/C14H11NO/c16-14-13-9-5-4-6-11(13)10-15(14)12-7-2-1-3-8-12/h1-9H,10H2
charge 0 multiplicity 1
27 atoms
O  0.135152 2.293648 0.001074
N  -0.349664 -0.063536 -0.000173
C  0.430168 -1.329453 -0.000283
C  1.871235 -0.856166 0.000199
C  1.893487 0.555153 0.000174
C  0.497974 1.083395 0.000291
C  -1.775244 -0.079577 -0.000335
C  3.068909 -1.593115 0.000194
C  3.102839 1.277828 0.000312
C  4.292638 -0.876458 0.00028
C  -2.534703 1.125464 -0.000083
C  -2.463167 -1.327404 -0.000351
C  4.310994 0.54338 0.000349
C  -3.943983 1.066111 0.000093
C  -3.872211 -1.367654 -0.000123
C  -4.626884 -0.172223 0.000069
H  0.190408 -1.935819 -0.895992
H  0.190013 -1.936255 0.895029
H  3.066837 -2.689205 -0.000037
H  3.089927 2.372865 0.000359
H  5.240615 -1.426344 0.000253
H  -2.014644 2.085354 -0.000206
H  -1.908998 -2.271307 -0.000433
H  5.271364 1.070646 0.000486
H  -4.509876 2.004887 0.00023
H  -4.378804 -2.339637 -0.000092
H  -5.721682 -0.20548 0.000217
