program: Gaussian 09
title: 000097032
version: EM64L-G09RevD.01
frameworkgroup: C1[X(C12H6Cl4O2)]
method: RPBEPBE
basis: SDD
operation: Freq
keyword: #p
keyword: freq=noraman
keyword: PBEPBE/SDD
title: #p freq=noraman PBEPBE/SDD
converged: NO NO NO NO
title: Mulliken charges:
elementType: Cl Cl Cl Cl O O C C C C C C C C C C C C H H H H H H
charge: -0.048123 -0.048123 -0.002254 -0.002255 -0.380485 -0.380485 0.397816 0.397821 -0.379596 -0.379597 -0.392096 -0.392094 -0.278797 -0.278796 -0.282846 -0.282847 0.463540 0.463536 0.268512 0.268512 0.265963 0.265961 0.368367 0.368367
chargesum: 0.00000
title: Mulliken charges with hydrogens summed into heavy atoms:
elementType: Cl Cl Cl Cl O O C C C C C C C C C C C C
charge: -0.048123 -0.048123 -0.002254 -0.002255 -0.012118 -0.012118 0.397816 0.397821 -0.111084 -0.111085 -0.126133 -0.126133 -0.278797 -0.278796 -0.282846 -0.282847 0.463540 0.463536
polarizability: 2.95693823e+02 7.87999159e-05 2.08773634e+02 8.20832685e-02 -6.26621067e-05 7.54448216e+01
1716.lowfreq: 0.0016 0.0025 0.0027 6.7293 6.9487 7.7606 24.2555 54.3359 60.9772
frequency: 24.2539 54.3311 60.9768 100.6753 101.5813 146.0011 171.9785 186.3592 190.2672 201.8999 215.9343 256.4658 273.0831 281.4651 307.8682 353.4947 356.7288 366.2129 402.0254 453.2683 453.9222 462.1306 489.0172 491.4734 545.5316 546.3633 575.7123 602.2810 638.7280 713.8542 715.1286 730.6799 750.6056 751.7833 813.5872 858.4580 874.5405 880.6117 887.4692 891.8486 1046.0001 1050.4422 1070.9925 1143.7074 1150.6222 1228.7282 1241.0708 1268.6398 1282.7252 1312.0018 1347.7106 1375.7671 1407.9151 1408.5635 1457.3119 1495.3477 1552.4581 1565.1209 1603.9292 1608.7855 3162.1846 3165.0659 3165.6744 3168.5764 3485.8521 3486.4981
redmass: 22.1001 8.5076 13.8584 12.3899 13.5452 29.7306 9.4851 17.3048 18.7517 4.7847 4.7626 11.8519 7.5385 7.9263 8.8112 18.4513 16.2664 6.9783 7.9152 1.1033 1.1054 7.0370 5.1595 5.3642 4.5210 5.7531 11.8257 4.5061 4.2906 4.3572 5.2969 8.4726 9.6270 8.5431 6.9524 1.4288 1.5121 1.3642 3.8531 1.8587 3.6663 3.4821 3.4918 1.5008 1.6101 1.7607 1.6936 1.5194 1.7431 4.1307 3.5391 5.2127 4.2279 6.2241 3.7539 4.9901 5.5761 7.0423 7.5710 8.4052 1.0922 1.0929 1.0911 1.0924 1.0649 1.0650
irintensity: 0.0179 0.0542 0.1446 0.0001 0.0032 0.0073 0.1122 0.0883 0.7470 0.7935 0.0927 0.0744 0.8285 12.8179 7.0746 1.9611 0.7174 4.0860 3.3594 19.8565 262.9121 6.9012 0.2888 2.6595 22.6944 2.0258 78.1250 11.2657 0.0552 0.2993 10.1622 13.2912 21.3179 123.4518 20.2588 54.2482 1.2548 7.6943 0.0799 1.7033 2.0327 0.0648 97.3415 339.8705 62.9886 242.0096 0.0274 8.9926 13.2206 39.2415 3.1010 98.2872 46.4356 2.5977 346.9939 8.1394 93.8785 7.8784 0.0271 0.0516 0.1522 2.8607 0.0997 0.0140 144.0279 53.8725
temp: 298.150 k
press: 1.00000 atm
elementType: 17 17 17 17 8 8 6 6 6 6 6 6 6 6 6 6 6 6 1 1 1 1 1 1
symmnumber: 1
zpe: 385378.7 jmol-1
zpe.correction: 0.146783 hartree
zpe.thermalcorrener: 0.163483 hartree
zpe.thermalcorrenthalpy: 0.164427 hartree
zpe.thermalcorrgfe: 0.100764 hartree
zpe.sumelectzpe: -2450.294380 hartree
zpe.sumelectthermal: -2450.277681 hartree
zpe.sumelectthermalent: -2450.276736 hartree
zpe.sumelectthermalfe: -2450.340399 hartree
dipole: 0.0000 -2.9419 0.0000
dipole: 2.9419
quadrupole: -134.3273 -130.8660 -133.8355
quadrupole: 0.0000 4.7786 0.0000
quadrupole: -1.3177 2.1436 -0.8259 0.0000 4.7786 0.0000
hfenergy: -2450.4411633 hartree
pointgroup: C01 [X(C12H6Cl4O2)]
dipole: 0.0000013 1.1574266 0.0000039 debye
dipolederiv: -0.386392 -0.2501499 0.0744089 -0.3322897 -0.5512541 0.1537298 0.096986 0.1512142 -0.0884509 -0.3863912 0.2501506 0.0744069 0.3322888 -0.5512559 -0.1537255 0.0969863 -0.151213 -0.0884487 -0.2757631 0.2367914 -0.0692264 0.3736383 -0.5399548 0.1524413 -0.1087735 0.1506521 -0.0741419 -0.2757633 -0.2367907 -0.0692263 -0.3736385 -0.5399551 -0.1524402 -0.1087729 -0.1506492 -0.0741411 -1.6869752 -0.1066842 0.0356633 -0.0884458 -0.1094312 -0.0685127 0.0294553 -0.0720154 -0.3469014 -1.6869733 0.1066868 0.0356664 0.088448 -0.1094312 0.0685111 0.0294501 0.0720156 -0.3469014 0.3213255 -0.0222527 0.0043958 0.0183622 -0.0445157 -0.0300215 -0.0097685 -0.0014348 -0.0107112 0.3213224 0.0222519 0.0043948 -0.0183648 -0.0445155 0.0300215 -0.0097639 0.0014359 -0.0107116 -0.1885997 0.0304218 -0.0148526 0.1387125 -0.1338322 -0.0050915 -0.093816 0.0072165 -0.0931763 -0.1885998 -0.0304213 -0.0148544 -0.1387107 -0.1338318 0.0050914 -0.0938185 -0.0072164 -0.0931765 -0.189656 0.050756 -0.0077898 -0.1445192 -0.1533495 0.0046011 0.0996629 0.0095858 -0.0868086 -0.1896548 -0.0507563 -0.0077875 0.1445218 -0.1533496 -0.0045998 0.0996659 -0.0095806 -0.0868057 0.1978666 0.2602912 -0.0771795 0.7795434 0.7900156 -0.2651931 -0.2633073 -0.2606651 -0.006327 0.1978648 -0.2602892 -0.0771772 -0.7795443 0.7900183 0.265188 -0.2633049 0.2606639 -0.0063291 0.2244294 -0.282782 0.0820724 -0.8125581 0.8446532 -0.273504 0.2717194 -0.2718507 0.0044628 0.2244296 0.2827826 0.0820757 0.8125593 0.8446528 0.2735003 0.2717183 0.2718471 0.0044609 1.2967507 0.070092 -0.0246759 0.0567535 -0.3597445 0.1467158 -0.0197849 0.1368215 0.0630441 1.2967495 -0.0700952 -0.0246807 -0.0567549 -0.3597434 -0.1467137 -0.0197812 -0.1368239 0.0630435 0.0947385 -0.0654923 0.0202062 -0.0750816 0.0319891 0.0395378 0.0324126 0.0318202 0.1367127 0.094739 0.0654917 0.0202049 0.0750811 0.0319881 -0.0395374 0.0324144 -0.0318214 0.1367126 0.0953249 0.0667444 -0.0201183 0.0763812 0.0332703 0.0406435 -0.030766 0.0354743 0.1395324 0.0953229 -0.0667459 -0.0201195 -0.0763826 0.0332702 -0.0406436 -0.0307665 -0.0354772 0.1395306 0.4969528 0.0150318 -0.0029036 0.0129248 0.1921536 0.0486909 -0.0040236 0.0490419 0.362766 0.4969521 -0.0150322 -0.0029036 -0.0129248 0.1921532 -0.0486896 -0.0040234 -0.0490415 0.362766 unknown
polarizability: 295.6915577|-0.0002238|208.773634|-0.7111327|-0.0005089|75.4470871 unknown
InChI: InChI=1S/C12H6Cl4O2/c13-7-1-5(2-8(14)11(7)17)6-3-9(15)12(18)10(16)4-6/h1-4,17-18H
charge 0 multiplicity 1
24 atoms
Cl 3.823451 2.666863 -0.770386
Cl -3.823448 2.666879 0.770346
Cl 3.773755 -2.666094 0.761477
Cl -3.773758 -2.666088 -0.761485
O  5.008737 -0.051456 0.004899
O  -5.008738 -0.051445 -0.004912
C  0.744605 0.019176 -0.001149
C  -0.744605 0.019178 0.001128
C  1.474923 -1.156273 0.327842
C  -1.474926 -1.156274 -0.327841
C  1.473392 1.192969 -0.333154
C  -1.47339 1.192973 0.333123
C  2.873497 1.166308 -0.327402
C  -2.873494 1.166321 0.327371
C  2.878004 -1.157588 0.322786
C  -2.878006 -1.157582 -0.322794
C  3.621771 0.004434 -0.005701
C  -3.621771 0.004444 0.005687
H  0.950734 -2.069474 0.624332
H  -0.950744 -2.069481 -0.624324
H  0.954235 2.108704 -0.630109
H  -0.954226 2.108705 0.630084
H  5.389175 0.834393 -0.243651
H  -5.389175 0.834407 0.243633
