program: Gaussian 09
title: 000097005
version: EM64L-G09RevD.01
frameworkgroup: C1[X(C7H9N3O3)]
method: RPBEPBE
basis: SDD
operation: Freq
keyword: #pfreq=noraman
keyword: PBEPBE/SDD
title: #p freq=noraman PBEPBE/SDD
converged: YES YES NO NO
title: Mulliken charges:
elementType: O O O N N N C C C C C C C H H H H H H H H H
charge: -0.441849 -0.230816 -0.226046 -0.326438 -0.055132 0.028028 -0.364379 0.161452 -0.357491 -0.268083 -0.267966 0.348791 -0.416477 0.224671 0.223547 0.350032 0.208451 0.241879 0.239903 0.288819 0.290906 0.348197
chargesum: 0.00000
title: Mulliken charges with hydrogens summed into heavy atoms:
elementType: O O O N N N C C C C C C C
charge: -0.093652 -0.230816 -0.226046 0.023594 -0.055132 0.028028 0.083839 0.161452 0.092839 -0.028180 0.020854 0.348791 -0.125571
polarizability: 2.12986283e+02 -4.24027231e+00 1.07626540e+02 4.03904406e-01 -1.73289777e+00 5.57945383e+01
1716.lowfreq: -12.9528 -6.3386 0.0004 0.0008 0.0009 5.6492 29.8100 61.8612 75.7433
frequency: 29.4251 61.8609 75.7133 91.5961 123.7397 158.0619 231.7898 251.6027 279.3783 341.7199 356.5899 421.2802 458.7566 492.3410 495.5535 519.4787 618.7436 651.5894 668.7623 693.2653 762.0890 765.1505 810.5840 823.1890 866.6380 925.0717 956.1212 975.5766 987.8830 1019.9315 1041.1613 1096.0931 1128.7031 1140.3656 1178.8269 1215.6750 1231.6681 1263.5911 1304.7342 1325.8088 1341.8990 1364.0402 1369.9233 1380.3842 1412.4990 1435.5125 1463.8441 1474.6430 1522.6124 1556.2794 1604.7406 2929.0700 2995.8447 3012.6764 3096.7268 3162.3325 3167.2045 3185.3057 3495.9475 3565.6558
redmass: 6.0901 5.7247 6.6140 4.7178 3.6921 5.9056 6.4176 2.9743 4.7471 1.4691 2.4389 3.7430 5.7650 2.8298 3.3786 5.9988 7.7004 5.2385 3.3406 1.4873 5.7279 4.6187 2.9086 1.6692 3.0147 2.4051 1.4232 3.7953 1.3302 1.8384 1.9707 2.3385 2.9712 1.7527 1.3181 1.5395 4.2822 1.4989 1.3818 1.2783 4.2877 1.7264 3.5366 1.2110 3.7376 2.0319 1.0810 1.0815 3.6549 6.3817 6.8859 1.0666 1.0682 1.0914 1.1003 1.0893 1.0925 1.0973 1.0762 1.0664
irintensity: 1.3379 2.5362 3.1595 0.3491 5.1398 6.7907 1.2080 4.1675 2.2173 196.2253 22.7165 1.5242 1.6564 20.5903 13.1681 8.0897 5.8894 40.6224 54.6391 57.6698 3.7355 20.9709 3.5391 34.2186 25.1180 2.4676 11.4578 5.9878 1.8821 122.5095 3.3247 7.1204 4.2630 48.5124 12.6954 291.0612 479.9477 4.0353 5.6943 10.9127 78.3823 30.5568 11.7924 11.9481 63.3695 13.3159 12.2906 47.0535 163.7432 27.0840 612.0822 69.0423 54.8083 47.4740 23.4084 7.5830 0.1546 5.4619 174.1036 10.4438
temp: 298.150 k
press: 1.00000 atm
elementType: 8 8 8 7 7 7 6 6 6 6 6 6 6 1 1 1 1 1 1 1 1 1
symmnumber: 1
zpe: 432912.1 jmol-1
zpe.correction: 0.164888 hartree
zpe.thermalcorrener: 0.177015 hartree
zpe.thermalcorrenthalpy: 0.177959 hartree
zpe.thermalcorrgfe: 0.125072 hartree
zpe.sumelectzpe: -661.007087 hartree
zpe.sumelectthermal: -660.994960 hartree
zpe.sumelectthermalent: -660.994016 hartree
zpe.sumelectthermalfe: -661.046903 hartree
dipole: -8.4822 3.6281 -1.0261
dipole: 9.2824
quadrupole: -91.0572 -76.6523 -72.9591
quadrupole: -9.9412 5.3220 1.0311
quadrupole: -10.8343 3.5706 7.2637 -9.9412 5.3220 1.0311
hfenergy: -661.1719748 hartree
pointgroup: C01 [X(C7H9N3O3)]
dipole: -3.3320758 -1.4685636 0.2785551 debye
dipolederiv: -0.9225504 0.1039517 0.0089355 0.2404066 -0.4713097 -0.2675988 0.046421 -0.2912271 -0.3656697 -0.8734423 0.1993294 0.0111942 0.5059557 -0.688641 -0.0233563 0.0262646 -0.0224581 -0.257186 -0.8769747 -0.2169043 -0.0106189 -0.4992398 -0.6886621 -0.0228421 -0.0273437 -0.0238245 -0.2456127 -2.0275118 -0.0908038 -0.0084062 0.2429567 -0.2293143 0.0521785 -0.2446464 0.0404834 -0.4223065 -1.1331124 0.0702998 0.0037201 -0.5634044 -0.3176035 -0.0019685 -0.0295817 -0.0040827 -0.2725251 2.4009448 0.0162202 -0.0005145 -0.0122174 1.0814035 0.0462412 0.0005734 0.0460302 0.2080171 0.4189111 0.2245982 -0.0286573 0.626681 0.274728 -0.0827043 0.0256031 -0.0439844 0.3062968 2.1062664 0.0267053 0.0136546 -0.2877928 0.167884 -0.0060552 0.036015 0.0007196 0.1972862 0.6162859 -0.1106352 -0.0715939 -0.2053546 0.436768 0.1822668 -0.0433816 0.2039152 0.4049036 -0.7881957 -0.0443002 -0.0083236 0.6441143 -0.0438271 -0.0005445 0.0369354 0.0064695 -0.1995984 0.695672 0.1223779 0.0088637 0.367072 0.168146 0.0133009 0.0166553 0.0138173 -0.0597344 -1.3463734 0.0293093 0.0021521 -0.0589778 -0.3363413 -0.0205704 0.0000662 -0.0227366 0.0321742 0.8097589 -0.1771209 -0.0089854 -0.2554529 0.3175702 0.0183505 -0.0081602 0.0169279 -0.003617 -0.077949 -0.0158308 -0.0017667 -0.2136439 -0.0160574 0.0815166 0.0892963 0.1290714 -0.1296712 -0.0005588 0.0769405 0.0665155 -0.0718999 -0.0450154 -0.090553 -0.012911 -0.1014982 -0.0133631 0.347756 -0.0320465 -0.0102623 -0.215391 0.1980559 -0.0155395 0.0214812 -0.0314122 0.3000987 -0.1388578 -0.0992885 0.006048 -0.1224297 -0.1183595 -0.0555062 0.0554804 -0.0108258 0.0667389 0.1117845 0.0174116 0.0243816 0.0660024 0.0334009 0.0672299 -0.0015617 0.0188961 -0.0965787 0.0243645 -0.0888751 -0.0023221 -0.0961549 -0.0343477 -0.0070946 -0.0002823 -0.0112353 0.1644829 0.1050184 0.0621601 0.0029064 0.0143773 0.0570458 -0.0048709 -0.0013405 -0.0046144 0.1600519 0.0687047 -0.0594775 -0.0034959 -0.0404649 0.0577036 -0.0046329 -0.0039061 -0.0039024 0.1337775 0.4800589 -0.0140212 0.0065749 -0.065142 0.1967733 0.1427529 0.0183233 0.0954711 0.0920351 unknown
polarizability: 212.9593429|4.5024461|107.4381107|-1.203354|3.6586984|56.0099079 unknown
InChI: InChI=1S/C7H9N3O3/c11-4-3-8-7-2-1-6(5-9-7)10(12)13/h1-2,5,8,11H,3-4H2
charge 0 multiplicity 1
22 atoms
O  -4.870208 0.82817 0.442062
O  4.042918 -1.126766 -0.081018
O  4.035653 1.158502 0.040282
N  -2.165756 0.210428 -0.04208
N  -0.104346 1.273473 0.045206
N  3.428073 0.014821 -0.021107
C  -3.132034 -0.887544 -0.044634
C  -0.80071 0.079348 -0.02763
C  -4.524784 -0.330142 -0.39674
C  -0.136503 -1.192391 -0.086561
C  1.261702 -1.219124 -0.086812
C  1.967918 0.008734 -0.023496
C  1.24517 1.227497 0.045335
H  -3.160313 -1.396763 0.944903
H  -2.852061 -1.648387 -0.799751
H  -2.53777 1.156736 0.097816
H  -5.282969 -1.134859 -0.32312
H  -4.525337 0.07045 -1.423314
H  -0.704984 -2.125098 -0.123667
H  1.821586 -2.157144 -0.130674
H  1.780708 2.179623 0.103552
H  -5.070551 0.529635 1.36525
