program: Gaussian 09
title: 000098163
version: EM64L-G09RevD.01
frameworkgroup: C1[X(C9H9NO2)]
method: RPBEPBE
basis: SDD
operation: Freq
keyword: #pfreq=noraman
keyword: PBEPBE/SDD
title: #p freq=noraman PBEPBE/SDD
converged: YES YES NO NO
title: Mulliken charges:
elementType: O O N C C C C C C C C C H H H H H H H H H
charge: -0.276962 -0.249448 -0.000494 0.476339 -0.234859 -0.301991 -0.319377 -0.322807 -0.343873 -0.335542 0.224689 -0.503880 0.259467 0.229612 0.237635 0.251298 0.243989 0.245485 0.243270 0.243130 0.234319
chargesum: 0.00000
title: Mulliken charges with hydrogens summed into heavy atoms:
elementType: O O N C C C C C C C C C
charge: -0.276962 -0.249448 -0.000494 0.476339 0.024607 -0.072379 -0.081742 -0.071509 -0.099883 -0.090058 0.224689 0.216839
polarizability: 2.07891429e+02 6.26918575e+00 1.08839545e+02 -1.49924151e-02 -1.81452441e-02 4.93911209e+01
1716.lowfreq: -8.0748 -3.9681 0.0007 0.0008 0.0009 6.3749 35.8165 61.0025 77.4137
frequency: 34.8776 60.7281 77.4129 78.5399 111.0076 207.9864 220.6746 257.5892 275.8400 321.5411 367.1914 490.7560 510.7053 560.4482 661.2533 674.6764 681.6466 744.8638 814.5486 823.1858 876.4084 899.9399 901.3769 959.3775 966.3576 977.2222 982.8670 1010.6472 1060.6966 1086.2948 1112.1379 1133.1725 1147.8685 1208.9097 1228.9582 1288.2181 1305.1983 1315.2128 1341.7855 1406.4692 1421.6196 1450.2698 1461.7818 1467.7235 1544.3739 1583.3973 1617.1815 1651.5995 3004.0165 3104.9838 3105.5117 3130.9408 3134.7322 3150.0209 3153.2279 3160.4635 3164.4832
redmass: 3.3615 1.3387 2.9579 4.7777 3.9414 5.1060 2.8736 6.3568 4.2949 4.6892 2.4653 4.5933 3.1010 7.4321 6.9848 5.1474 5.4408 3.1051 5.7118 1.4673 1.3277 4.8800 1.8380 7.0642 1.3581 1.4930 5.8931 1.1726 2.2172 1.6341 1.2674 3.4146 1.4497 1.5362 1.3376 3.3273 1.5857 3.4024 1.2983 1.9937 1.1919 1.0500 1.0530 1.9992 6.7765 5.4493 10.2205 5.8473 1.0296 1.1044 1.0904 1.0876 1.0886 1.1046 1.0971 1.0953 1.0943
irintensity: 0.5113 0.0884 0.1832 0.3565 6.4240 3.8763 5.6179 9.3819 0.0306 13.5060 0.0097 1.9543 25.0352 23.3389 0.9360 0.2671 6.1935 0.3429 7.1468 69.1447 0.7171 2.1831 2.8689 2.3425 2.0520 0.0481 35.5890 50.6579 0.6616 2.0155 0.1167 414.2160 13.6177 26.8980 20.4265 10.8119 63.7897 45.8308 15.8083 17.3318 26.2671 14.8300 14.0679 13.4757 28.4910 33.6856 225.6239 68.2790 38.0787 26.8472 1.8119 8.4042 13.5204 18.3090 34.4227 0.7871 13.5655
temp: 298.150 k
press: 1.00000 atm
elementType: 8 8 7 6 6 6 6 6 6 6 6 6 1 1 1 1 1 1 1 1 1
symmnumber: 1
zpe: 421629.3 jmol-1
zpe.correction: 0.160590 hartree
zpe.thermalcorrener: 0.171965 hartree
zpe.thermalcorrenthalpy: 0.172909 hartree
zpe.thermalcorrgfe: 0.121544 hartree
zpe.sumelectzpe: -552.668078 hartree
zpe.sumelectthermal: -552.656703 hartree
zpe.sumelectthermalent: -552.655759 hartree
zpe.sumelectthermalfe: -552.707124 hartree
dipole: -2.0441 -0.9519 -0.0033
dipole: 2.2549
quadrupole: -72.5285 -66.1732 -72.3549
quadrupole: 9.1352 0.0078 -0.0349
quadrupole: -2.1763 4.1790 -2.0027 9.1352 0.0078 -0.0349
hfenergy: -552.8286676 hartree
pointgroup: C01 [X(C9H9N1O2)]
dipole: 0.8008735 0.3815645 -0.005579 debye
dipolederiv: -1.5019642 -0.369011 0.0011998 -0.6452611 -0.7340816 0.0085029 0.011567 0.0113118 -0.3032107 -0.8580323 0.1655822 -0.010486 0.2016148 -0.8765796 0.0204257 -0.011281 0.0202925 -0.3239897 -0.4468371 0.0011533 -0.0018789 0.0732403 -0.310872 0.0022056 -0.004183 0.0017062 -0.2516439 0.187547 0.0454834 -0.0001825 0.0495084 0.0857103 -0.0004202 -0.0008454 -0.0005895 0.0494305 0.5038953 -0.0342854 0.0065239 0.0386394 0.1334264 -0.0069782 0.0047455 -0.0074851 -0.0957893 -0.260032 0.2096767 -0.0072614 0.0582374 -0.1065733 0.0012034 -0.0026323 0.0024705 -0.0907614 -0.3557514 -0.2063417 0.0036927 0.0432158 0.0201945 -0.0033369 -0.0041296 -0.0056639 -0.1096853 -1.0651137 0.0051963 -0.0082255 -0.1396333 0.0439522 -0.0085234 -0.0041288 -0.0071148 -0.1748718 0.1555682 -0.2213906 0.0084449 -0.1523135 0.3195658 -0.0125112 0.0063477 -0.013056 -0.0728344 0.3867925 0.2634916 -0.0033145 0.1234395 0.1863271 -0.0059716 0.0013824 -0.0044943 -0.0666954 2.2551429 0.1811278 0.0122291 0.2385341 1.2384206 -0.0310544 0.009656 -0.0317274 0.2506182 0.7720658 0.1013701 0.0016138 0.0243053 0.2222531 0.0020447 0.0032071 0.0023325 0.2791616 0.0803548 0.003297 -0.000816 0.0497191 -0.0305109 0.0061774 -0.002019 0.0056393 0.1496705 0.0241629 -0.1169952 0.0020892 -0.0755735 -0.0021274 0.0034224 0.0008301 0.0030831 0.1452292 0.0800209 0.0879733 -0.0032734 0.0462886 -0.0635559 0.0066916 -0.0021106 0.0071569 0.155344 0.0848411 0.0457686 -0.0023052 0.0806664 -0.0389518 0.0077111 -0.0033424 0.0072469 0.1720348 0.0594638 0.055089 -0.0022914 0.0632232 -0.0991255 0.0073187 -0.0024887 0.0071203 0.1386827 -0.0069878 -0.1069784 0.0016758 -0.1041628 -0.0388831 0.004045 0.0014977 0.0038586 0.137783 -0.0426756 -0.0180528 0.0060514 0.0840952 0.0496898 -0.105743 0.0521863 -0.0808188 -0.0482953 -0.0424018 -0.0199239 -0.0048608 0.077952 0.0629279 0.0990165 -0.0580706 0.0724176 -0.063251 -0.0100594 -0.0722302 0.001375 -0.1357353 -0.0612066 0.0057741 0.0038115 0.0063137 0.1230735 unknown
polarizability: 207.7599963|7.1810933|108.9082398|1.2327437|-1.7177866|49.4538587 unknown
InChI: InChI=1S/C9H9NO2/c1-12-9(11)3-2-8-4-6-10-7-5-8/h2-7H,1H3
charge 0 multiplicity 1
21 atoms
O  3.551168 0.895054 0.019904
O  3.026629 -1.383333 0.091802
N  -4.035097 0.359501 -0.029422
C  -1.218539 -0.204755 0.013173
C  0.210198 -0.552466 0.037256
C  -1.707938 1.132434 -0.029658
C  -2.188353 -1.245737 0.03377
C  1.263163 0.318347 0.018559
C  -3.098206 1.359313 -0.049275
C  -3.562297 -0.922132 0.011709
C  2.654137 -0.183686 0.047894
C  4.986408 0.52719 0.046525
H  0.455295 -1.624159 0.073797
H  -1.02368 1.986479 -0.047092
H  -1.872988 -2.294638 0.066728
H  1.142733 1.405409 -0.018235
H  -3.497058 2.379344 -0.081648
H  -4.323657 -1.709848 0.026706
H  5.236113 -0.098805 -0.826742
H  5.220007 -0.031209 0.96874
H  5.523262 1.485395 0.01541
