program: Gaussian 09
title: 000098186
version: EM64L-G09RevD.01
frameworkgroup: C1[X(C14H19N)]
method: RPBEPBE
basis: SDD
operation: Freq
keyword: #pfreq=noraman
keyword: PBEPBE/SDD
title: #p freq=noraman PBEPBE/SDD
converged: YES YES NO NO
title: Mulliken charges:
elementType: N C C C C C C C C C C C C C C H H H H H H H H H H H H H H H H H H H
charge: -0.382123 -0.175795 -0.119273 -0.070596 -0.496138 -0.533700 -0.449981 -0.467889 -0.486030 0.427310 -0.382771 -0.447817 -0.225390 -0.221539 -0.243663 0.237186 0.228379 0.218516 0.216045 0.221471 0.203988 0.225614 0.214529 0.232120 0.202388 0.221867 0.257666 0.229511 0.196216 0.264561 0.231493 0.223584 0.223808 0.226454
chargesum: 0.00000
title: Mulliken charges with hydrogens summed into heavy atoms:
elementType: N C C C C C C C C C C C C C C
charge: -0.124457 0.061391 0.109106 0.147920 -0.058623 -0.104098 -0.003332 -0.043634 -0.060303 0.427310 -0.118210 -0.216325 -0.001806 0.002269 -0.017208
polarizability: 1.94686927e+02 1.68484958e+00 1.44682282e+02 2.12513366e+00 4.86474491e+00 1.04501110e+02
1716.lowfreq: -11.9242 -0.0006 -0.0005 0.0001 5.6255 12.9424 25.2809 38.5198 54.2039
frequency: 24.4597 37.8789 54.1860 88.8242 124.1160 196.0561 232.7955 267.8088 297.7454 362.6643 404.9940 417.5712 433.3469 482.3363 511.2096 551.4772 607.0326 616.5774 662.4237 705.4968 730.9011 748.9040 750.9679 797.6037 802.8814 816.7209 844.6354 857.2974 885.5232 913.9636 926.6456 934.8566 948.0945 960.0302 970.1236 978.7668 982.0020 989.9375 996.6190 1014.6079 1025.9033 1037.5671 1055.8334 1078.1502 1099.6849 1109.0145 1114.7284 1133.0175 1169.6974 1172.8170 1176.5902 1180.1702 1200.2111 1206.2483 1219.3434 1243.4250 1245.4348 1262.7923 1272.7272 1292.0403 1294.5025 1307.1879 1312.3394 1325.5583 1336.7534 1356.4346 1387.3176 1439.5503 1448.0838 1453.4491 1462.8243 1467.7077 1477.9615 1486.0361 1488.2756 1593.4138 1614.9720 2841.3277 2856.3268 2978.1989 2992.1209 2993.5246 2999.3962 3009.2970 3047.4808 3050.1181 3055.8584 3064.0487 3069.1982 3080.2052 3113.2022 3123.1556 3136.6433 3149.5456 3162.2647 3438.2966
redmass: 3.6395 3.8434 3.4225 3.3393 2.8195 3.0470 3.6959 2.0808 3.2969 2.0619 2.8115 2.6097 1.7782 2.8177 4.4310 3.7886 2.9861 6.3062 1.6280 2.0167 2.8358 2.1744 2.0810 2.7856 1.7803 2.9307 2.1812 1.2475 2.6504 1.3549 2.7167 1.8696 1.8285 1.8897 1.6864 1.4924 1.6281 5.8927 1.3613 2.3832 2.1113 1.6709 1.7006 1.5564 1.6674 1.4136 1.0609 1.6654 1.0639 2.0356 1.8261 1.1183 1.1995 1.5588 1.9674 1.3835 1.5511 1.3909 1.4103 1.4076 1.5362 1.5156 1.4178 1.4620 1.4242 1.6360 4.7350 2.0913 1.2033 1.1214 1.1000 1.0925 1.5724 1.3420 1.1470 6.1766 6.1666 1.0825 1.0718 1.0851 1.0598 1.0598 1.0599 1.0630 1.0887 1.1030 1.1006 1.0942 1.1056 1.1036 1.0867 1.0865 1.0920 1.0952 1.1012 1.0747
irintensity: 0.0682 0.1679 0.1678 0.5984 0.1449 2.0492 1.4369 5.2004 0.3825 2.4187 0.3399 1.5315 0.1739 14.7275 2.4833 0.3118 22.1473 0.4916 49.7063 40.2444 14.3819 16.0064 38.1759 1.1332 6.6188 5.7086 0.7647 0.0364 3.2835 2.6514 1.9274 5.0126 6.2724 1.6462 0.7071 3.5434 6.7959 0.1250 1.1524 2.3702 13.2613 1.2721 5.9927 10.1162 2.5656 8.4335 0.2887 11.2328 0.4082 19.8851 17.1994 1.3475 2.8396 1.5829 14.5658 4.8510 0.8464 2.2875 0.5397 1.8960 1.7109 5.0153 4.8248 1.7773 42.0040 11.4573 0.1672 8.6313 13.4986 8.6563 7.9672 13.6606 27.2239 0.8716 5.0539 0.7111 7.9778 69.6190 114.0992 21.1083 42.0702 39.8058 46.0001 60.7361 95.8892 13.2054 9.2565 43.8038 41.1584 62.5639 8.5715 0.3469 25.8775 33.5495 22.7482 0.3832
temp: 298.150 k
press: 1.00000 atm
elementType: 7 6 6 6 6 6 6 6 6 6 6 6 6 6 6 1 1 1 1 1 1 1 1 1 1 1 1 1 1 1 1 1 1 1
symmnumber: 1
zpe: 781389.1 jmol-1
zpe.correction: 0.297615 hartree
zpe.thermalcorrener: 0.310543 hartree
zpe.thermalcorrenthalpy: 0.311487 hartree
zpe.thermalcorrgfe: 0.256490 hartree
zpe.sumelectzpe: -598.496645 hartree
zpe.sumelectthermal: -598.483717 hartree
zpe.sumelectthermalent: -598.482773 hartree
zpe.sumelectthermalfe: -598.537770 hartree
dipole: -0.2956 -0.8663 0.4067
dipole: 1.0016
quadrupole: -86.6660 -86.7289 -92.5681
quadrupole: 0.2091 0.6286 0.7457
quadrupole: 1.9884 1.9254 -3.9138 0.2091 0.6286 0.7457
hfenergy: -598.79426 hartree
pointgroup: C01 [X(C14H19N1)]
dipole: 0.1243692 0.3739094 0.0037869 debye
polarizability: 194.6734275|-0.6904084|134.0818499|-3.1989002|-18.3017439|115.1150418 unknown
InChI: InChI=1S/C14H19N/c1-2-4-11(5-3-1)10-15-14-9-12-6-7-13(14)8-12/h1-5,12-15H,6-10H2
charge 0 multiplicity 1
34 atoms
N  0.357191 0.566056 0.318883
C  2.434277 0.023859 -1.080108
C  3.86416 -0.042895 0.69897
C  1.737846 0.957117 -0.029459
C  3.929412 0.357567 -0.804529
C  2.700558 0.85852 1.21114
C  2.332275 -1.452199 -0.599749
C  3.342684 -1.507977 0.607367
C  -0.645753 0.78019 -0.746848
C  -2.041289 0.346862 -0.312374
C  -2.22653 -0.837471 0.447073
C  -3.179336 1.106966 -0.680675
C  -3.522801 -1.254077 0.822591
C  -4.478608 0.689515 -0.310054
C  -4.65465 -0.493772 0.443283
H  2.091033 0.185918 -2.116057
H  4.799308 0.064923 1.273498
H  1.768519 1.997845 -0.442197
H  4.176562 1.424144 -0.962084
H  4.626565 -0.264842 -1.393838
H  2.184794 0.398635 2.075097
H  3.066187 1.855534 1.517032
H  2.623632 -2.148799 -1.406924
H  1.300733 -1.687656 -0.286974
H  2.855592 -1.827452 1.546433
H  4.174344 -2.208424 0.405151
H  0.053693 0.987074 1.207653
H  -0.329778 0.178608 -1.623613
H  -0.683029 1.84194 -1.099475
H  -1.34262 -1.413909 0.740969
H  -3.048261 2.030347 -1.259126
H  -3.652322 -2.171406 1.408708
H  -5.348807 1.288319 -0.60268
H  -5.66028 -0.817661 0.734715
